{"text_format":"1","workbook":"xlsx","n_sheets":5,"sheets":["Menu","Instruções","Cadastro","Consultar Receita","Banco"],"not_rendered":{"charts":0,"images":3,"macros":1,"external_links":1,"defined_names":17,"comments":0,"pivot_tables":0},"unopened":[],"bounds":{"document_bytes":16777216,"sheet_cells":100000,"rows_first":2000,"rows_last":500,"rows_between":2000,"halvings":0,"cell_chars":16384,"cell_head_chars":4096},"cells_cut":0,"cells_raw":0,"read":"whole","date_system":"1900"}

{"sheet":"Menu","index":0,"n_rows":3,"n_cols":4,"rows_kept":3,"cut":false,"hidden":false,"merged":[[2,3,2,11],[5,4,7,6],[5,8,7,10],[9,4,11,6],[9,8,11,10]]}
[]
[]
[null,null,null,"LIVRO DE RECEITAS"]

{"sheet":"Instruções","index":1,"n_rows":25,"n_cols":2,"rows_kept":25,"cut":false,"hidden":false,"merged":[[8,1,8,15],[10,1,10,15],[16,0,18,0],[0,0,0,15],[2,0,3,0],[2,1,3,15],[5,0,6,0],[5,1,5,15],[6,1,6,15],[20,0,22,0],[14,1,14,15],[16,1,18,15],[20,1,22,15],[24,1,24,15]]}
["INSTRUÇÕES DE USO (Leia antes de utilizar a planilha)"]
[]
[1,"Ao abrir o arquivo pela primeira vez, certifique-se de ter habilitado a Planilha para edição. Caso contrário, o Excel não permitirá que sejam inseridas informações na planilha."]
[]
[]
[2,"Habilite as macros da planilha antes de utiliza-la. Para isto, siga as instruções do vídeo abaixo:"]
[null,"https://www.youtube.com/watch?v=nOrhtwX-Oac&t=1s"]
[]
[3,"Passo 1: Para cadastrar uma receita acesse a guia Cadastro.\n Na guia Cadastro, insira o nome da receita\nColoque os ingredientes da receita, no campo Ingredientes.\nInsira o Modo de Preparo.\nClique no botão Gravar Receita.\n"]
[]
[4,"Passo 2: Para conferir as receitas cadastradas clique em Consultar Receitas.\nPara pesquisar uma receita, selecione o nome da receita no campo Escolha uma Receita.\nFeito isso, os Ingredientes e o Modo de Preparo irão aparecer."]
[]
[5,"Todas as receitas são salvar na guia Banco, para conferí-las basta acessar esta guia."]
[]
[6,"A planilha foi desenvolvida em programação VBA, portanto qualquer alteração na planilha poderá comprometer o seu funcionamento."]
[]
[7,"Este modelo de planilha foi desenvolvido e testado no Microsoft Excel para Windows. Não garantimos a compatibilidade com o Excel para MAC, Google Sheets, Excel para celular, tablet, ou qualquer outro software de Planilhas que não seja o Microsoft Excel para Windows."]
[]
[]
[]
[8,"A Planilha Caderno de Receitas é disponibilizada exclusivamente no site oficial do desenvolvedor. O download de modelo não lhe garante o direito de comercializá-lo ou distribuí-lo em outros sites. Qualquer violação de direitos autorais será respondida judicialmente."]
[]
[]
[]
[9,"Importante: Não realizamos alterações na planilha. Qualquer ajuste é de responsabilidade do usuário.\nA Planilha é bloqueada para edição em sua estrutura por questões de direitos autorais. Não fornecemos senhas da planilha."]

{"sheet":"Cadastro","index":2,"n_rows":8,"n_cols":10,"rows_kept":8,"cut":false,"hidden":false,"merged":[[3,9,5,10],[2,9,2,10],[1,1,1,7]]}
[1]
[null,"CADASTRO DE RECEITAS"]
[null,null,null,null,null,null,null,null,null,"Instruções:"]
[null,null,"Nome da Receita: ",null,null,null,null,null,null,"1. Insira o nome da receita\n2. Coloque os ingredientes da receita, no campo Ingredientes.\n3. Insira o Modo de Preparo.\n4. Clique no botão Gravar Receita.\nPara conferir as receitas cadastradas clique em Consultar Receitas."]
[]
[null,null,"Ingredientes: "]
[]
[null,null,"Modo de Preparo: "]

{"sheet":"Consultar Receita","index":3,"n_rows":6,"n_cols":7,"rows_kept":6,"cut":false,"hidden":false,"merged":[[1,1,1,4],[0,6,0,9],[3,6,4,10],[2,6,2,10]]}
[null,null,null,null,{"$f":"MATCH(D3,NomeReceita,0)","v":1}]
[null,"LIVRO DE RECEITAS"]
[null,null,"Escolha uma Receita:","Torta de liquidificador",null,null,"Instruções:"]
[null,null,null,null,null,null,"Para pesquisar uma receita, selecione o nome da receitas no campo Escolha uma Receita.\nFeito isso, os Ingredientes e o Modo de Preparo irão aparecer."]
[null,null,"Ingredientes: ","Modo de Preparo: "]
[null,null,{"$f":"VLOOKUP(E1,Banco!A2:D1094,3,0)","v":"1 ovo\nfarinha de trigo\n6 colheres (sopa) de farinha de trigo\nqueijo ralado\n5 colheres (sopa) de queijo ralado\norégano seco\n1 pitada de orégano\nfermento em pó químico\n1 colher (sobremesa) de fermento em pó\ncebola\n1/2 cebola\nleite\n1 xícara (chá) de leite\nóleo\n1/2 xícara (chá) de óleo\nsal\n1 pitada de sal"},{"$f":"VLOOKUP(E1,Banco!A2:D1094,4,0)","v":"Bata todos os ingredientes no liquidificador até que a massa esteja firme e encorpada.\nPara uma massa mais consistente, acrescente mais uma porção de farinha de trigo.\nUnte uma forma com óleo e despeje metade da massa até cobrir todo o fundo.\nEm seguida, acrescente um recheio de sua escolha e cubra com o restante da massa.\nAsse em forno médio (180° C), preaquecido, por 30 minutos."}]

{"sheet":"Banco","index":4,"n_rows":2,"n_cols":4,"rows_kept":2,"cut":false,"hidden":false,"merged":[]}
["Id","Nome da Receita","Ingredientes","Modo de Preparo"]
[1,"Torta de liquidificador","1 ovo\nfarinha de trigo\n6 colheres (sopa) de farinha de trigo\nqueijo ralado\n5 colheres (sopa) de queijo ralado\norégano seco\n1 pitada de orégano\nfermento em pó químico\n1 colher (sobremesa) de fermento em pó\ncebola\n1/2 cebola\nleite\n1 xícara (chá) de leite\nóleo\n1/2 xícara (chá) de óleo\nsal\n1 pitada de sal","Bata todos os ingredientes no liquidificador até que a massa esteja firme e encorpada.\nPara uma massa mais consistente, acrescente mais uma porção de farinha de trigo.\nUnte uma forma com óleo e despeje metade da massa até cobrir todo o fundo.\nEm seguida, acrescente um recheio de sua escolha e cubra com o restante da massa.\nAsse em forno médio (180° C), preaquecido, por 30 minutos."]