{"text_format":"1","workbook":"xlsx","n_sheets":5,"sheets":["Cadastrar","Busca","Banco de Dados","Instruções","Plan3"],"not_rendered":{"charts":0,"images":3,"macros":1,"external_links":1,"defined_names":9,"comments":0,"pivot_tables":0},"unopened":[],"bounds":{"document_bytes":16777216,"sheet_cells":100000,"rows_first":2000,"rows_last":500,"rows_between":2000,"halvings":0,"cell_chars":16384,"cell_head_chars":4096},"cells_cut":0,"cells_raw":0,"read":"whole","date_system":"1900"}

{"sheet":"Cadastrar","index":0,"n_rows":16,"n_cols":27,"rows_kept":16,"cut":false,"hidden":false,"merged":[[2,26,17,27],[13,23,14,24],[12,1,12,8],[12,10,12,12],[12,14,12,18],[1,1,8,4],[3,6,3,12],[3,18,3,20],[5,18,5,20],[5,14,5,16],[5,10,5,12],[5,6,5,8],[2,18,2,20],[8,12,8,14],[8,16,8,18],[10,1,10,8],[10,10,10,12],[10,14,10,20],[16,1,16,20],[13,1,13,2],[14,1,14,3],[14,5,14,8],[14,18,14,20],[14,14,14,16],[14,10,14,12],[15,1,15,2]]}
[]
[null,"Insira aqui a sua logo ou nome da empresa",null,null,null,null,null,null,null,null,null,null,null,null,null,null,null,null,null,null,null,null,{"$f":"Cadastrar!G9&-Cadastrar!I9&-Cadastrar!K9","v":"00"}]
[null,null,null,null,null,null,"Nome Completo:",null,null,null,null,null,null,null,"Código:",null,"Estado Civil:",null,"Sexo:",null,null,null,null,null,null,null,"Instruções:\n1. Insira os dados a serem cadastrados e clique em Cadastrar\n2. Para pesquisar os dados cadastrados clique no botão Pesquisar \n3. Para ir até o banco de dados clique em Banco de Dados\n4. Para limpar as células e realizar clique em Limpar"]
[]
[null,null,null,null,null,null,"Profissão:",null,null,null,"CPF:",null,null,null,"CNPJ:",null,null,null,"RG:"]
[]
[null,null,null,null,null,null,"Data de Nascimento:"]
[null,null,null,null,null,null,"Dia",null,"Mês",null,"Ano",null,"Nacionalidade:",null,null,null,"Naturalidade:",null,null,null,"UF:"]
[]
[null,"Endereço:",null,null,null,null,null,null,null,null,"Número:",null,null,null,"Complemento:"]
[]
[null,"Município:",null,null,null,null,null,null,null,null,"Bairro:",null,null,null,"Cep:",null,null,null,null,null,"UF:"]
[]
[null,"Telefone:",null,null,null,"Celular:",null,null,null,null,"Whatsapp:",null,null,null,"E-mail:",null,null,null,"Cadastrado em:",null,null,null,null,"Desenvolvido por:"]
[]
[null,"Observações:"]

{"sheet":"Busca","index":1,"n_rows":22,"n_cols":19,"rows_kept":22,"cut":false,"hidden":false,"merged":[[4,18,19,22],[19,1,19,5],[19,7,19,15],[21,1,21,15],[4,1,4,15],[20,1,20,2],[11,1,11,2],[11,4,11,5],[11,7,11,9],[11,13,11,15],[15,13,15,15],[13,4,13,5],[13,11,13,15],[15,1,15,2],[2,1,2,5],[2,7,2,11],[2,13,2,15],[18,7,18,8],[13,7,13,9],[15,4,15,5],[6,1,6,5],[9,1,9,5],[9,9,9,11],[9,13,9,15],[13,1,13,2],[17,7,17,9],[17,13,17,15],[15,7,15,11],[17,1,17,2],[17,4,17,5]]}
[]
[null,"CPF:",null,null,null,null,null,"CNPJ:",null,null,null,null,null,"Código:"]
[]
[null,"Nome:"]
[null,null,null,null,null,null,null,null,null,null,null,null,null,null,null,null,null,null,"Instruções\nPara pesquisar algum cadastro você deverá inserir um dos critérios de pesquisa, CPF, CNPJ, Código ou Nome e teclar Enter.\nImportante: Insira apenas um dos critérios\nPara a pesquisa insira o critério exatamente igual ao que foi cadastrado"]
[]
[null,"Resultado da busca"]
[]
[null,"Nome Completo:",null,null,null,null,null,"Código:",null,"Profissão:",null,null,null,"Sexo:"]
[null,{"$f":"IFERROR(IF(AND($B$3=\"\",$H$3=\"\",$N$3=\"\",$B$5=\"\"),\"\",IF(AND($H$3=\"\",$N$3=\"\",$B$5=\"\"),VLOOKUP($B$3,'Banco de Dados'!$B:$AC,2,0),IF(AND($B$3=\"\",$N$3=\"\",$B$5=\"\"),VLOOKUP($H$3,'Banco de Dados'!$A:$AC,3,0),IF(AND($B$3=\"\",$H$3=\"\",$B$5=\"\"),VLOOKUP(Busca!$N$3,'Banco de Dados'!$D:$AC,26,0),VLOOKUP($B$5,'Banco de Dados'!$C:$AC,1,0))))),\"\")","v":""},null,null,null,null,null,{"$f":"IFERROR(IF(AND($B$3=\"\",$H$3=\"\",$N$3=\"\",$B$5=\"\"),\"\",IF(AND($H$3=\"\",$N$3=\"\",$B$5=\"\"),VLOOKUP($B$3,'Banco de Dados'!$B:$AC,3,0),IF(AND($B$3=\"\",$N$3=\"\",$B$5=\"\"),VLOOKUP($H$3,'Banco de Dados'!$A:$AC,4,0),IF(AND($B$3=\"\",$H$3=\"\",$B$5=\"\"),VLOOKUP(Busca!$N$3,'Banco de Dados'!$D:$AC,1,0),VLOOKUP($B$5,'Banco de Dados'!$C:$AC,26,0))))),\"\")","v":""},null,{"$f":"IFERROR(IF(AND($B$3=\"\",$H$3=\"\",$N$3=\"\",$B$5=\"\"),\"\",IF(AND($H$3=\"\",$N$3=\"\",$B$5=\"\"),VLOOKUP($B$3,'Banco de Dados'!$B:$AC,25,0),IF(AND($B$3=\"\",$N$3=\"\",$B$5=\"\"),VLOOKUP($H$3,'Banco de Dados'!$A:$AC,26,0),IF(AND($B$3=\"\",$H$3=\"\",$B$5=\"\"),VLOOKUP(Busca!$N$3,'Banco de Dados'!$D:$AC,23,0),VLOOKUP($B$5,'Banco de Dados'!$C:$AC,24,0))))),\"\")","v":""},null,null,null,{"$f":"IFERROR(IF(AND($B$3=\"\",$H$3=\"\",$N$3=\"\",$B$5=\"\"),\"\",IF(AND($H$3=\"\",$N$3=\"\",$B$5=\"\"),VLOOKUP($B$3,'Banco de Dados'!$B:$AC,4,0),IF(AND($B$3=\"\",$N$3=\"\",$B$5=\"\"),VLOOKUP($H$3,'Banco de Dados'!$A:$AC,5,0),IF(AND($B$3=\"\",$H$3=\"\",$B$5=\"\"),VLOOKUP(Busca!$N$3,'Banco de Dados'!$D:$AC,2,0),VLOOKUP($B$5,'Banco de Dados'!$C:$AC,3,0))))),\"\")","v":""}]
[null,"CPF:",null,null,"CNPJ:",null,null,"RG:",null,null,null,"Estado Civil:",null,"Data de Nascimento:"]
[null,{"$f":"IFERROR(IF(AND($B$3=\"\",$H$3=\"\",$N$3=\"\",$B$5=\"\"),\"\",IF(AND($H$3=\"\",$N$3=\"\",$B$5=\"\"),VLOOKUP($B$3,'Banco de Dados'!$B:$AC,1,0),IF(AND($B$3=\"\",$N$3=\"\",$B$5=\"\"),VLOOKUP($H$3,'Banco de Dados'!$A:$AC,2,0),IF(AND($B$3=\"\",$H$3=\"\",$B$5=\"\"),VLOOKUP(Busca!$N$3,'Banco de Dados'!$D:$AC,22,0),VLOOKUP($B$5,'Banco de Dados'!$C:$AC,23,0))))),\"\")","v":""},null,null,{"$f":"IFERROR(IF(AND($B$3=\"\",$H$3=\"\",$N$3=\"\",$B$5=\"\"),\"\",IF(AND($H$3=\"\",$N$3=\"\",$B$5=\"\"),VLOOKUP($B$3,'Banco de Dados'!$B:$AC,23,0),IF(AND($B$3=\"\",$N$3=\"\",$B$5=\"\"),VLOOKUP($H$3,'Banco de Dados'!$A:$AC,1,0),IF(AND($B$3=\"\",$H$3=\"\",$B$5=\"\"),VLOOKUP(Busca!$N$3,'Banco de Dados'!$D:$AC,21,0),VLOOKUP($B$5,'Banco de Dados'!$C:$AC,22,0))))),\"\")","v":""},null,null,{"$f":"IFERROR(IF(AND($B$3=\"\",$H$3=\"\",$N$3=\"\",$B$5=\"\"),\"\",IF(AND($H$3=\"\",$N$3=\"\",$B$5=\"\"),VLOOKUP($B$3,'Banco de Dados'!$B:$AC,6,0),IF(AND($B$3=\"\",$N$3=\"\",$B$5=\"\"),VLOOKUP($H$3,'Banco de Dados'!$A:$AC,7,0),IF(AND($B$3=\"\",$H$3=\"\",$B$5=\"\"),VLOOKUP(Busca!$N$3,'Banco de Dados'!$D:$AC,4,0),VLOOKUP($B$5,'Banco de Dados'!$C:$AC,5,0))))),\"\")","v":""},null,null,null,{"$f":"IFERROR(IF(AND($B$3=\"\",$H$3=\"\",$N$3=\"\",$B$5=\"\"),\"\",IF(AND($H$3=\"\",$N$3=\"\",$B$5=\"\"),VLOOKUP($B$3,'Banco de Dados'!$B:$AC,5,0),IF(AND($B$3=\"\",$N$3=\"\",$B$5=\"\"),VLOOKUP($H$3,'Banco de Dados'!$A:$AC,6,0),IF(AND($B$3=\"\",$H$3=\"\",$B$5=\"\"),VLOOKUP(Busca!$N$3,'Banco de Dados'!$D:$AC,3,0),VLOOKUP($B$5,'Banco de Dados'!$C:$AC,4,0))))),\"\")","v":""},null,{"$f":"IFERROR(IF(AND($B$3=\"\",$H$3=\"\",$N$3=\"\",$B$5=\"\"),\"\",IF(AND($H$3=\"\",$N$3=\"\",$B$5=\"\"),VLOOKUP($B$3,'Banco de Dados'!$B:$AC,7,0),IF(AND($B$3=\"\",$N$3=\"\",$B$5=\"\"),VLOOKUP($H$3,'Banco de Dados'!$A:$AC,8,0),IF(AND($B$3=\"\",$H$3=\"\",$B$5=\"\"),VLOOKUP(Busca!$N$3,'Banco de Dados'!$D:$AC,5,0),VLOOKUP($B$5,'Banco de Dados'!$C:$AC,6,0))))),\"\")","v":""}]
[null,"Nacionalidade",null,null,"Naturalidade:",null,null,"UF:",null,null,null,"Endereço:"]
[null,{"$f":"IFERROR(IF(AND($B$3=\"\",$H$3=\"\",$N$3=\"\",$B$5=\"\"),\"\",IF(AND($H$3=\"\",$N$3=\"\",$B$5=\"\"),VLOOKUP($B$3,'Banco de Dados'!$B:$AC,8,0),IF(AND($B$3=\"\",$N$3=\"\",$B$5=\"\"),VLOOKUP($H$3,'Banco de Dados'!$A:$AC,9,0),IF(AND($B$3=\"\",$H$3=\"\",$B$5=\"\"),VLOOKUP(Busca!$N$3,'Banco de Dados'!$D:$AC,6,0),VLOOKUP($B$5,'Banco de Dados'!$C:$AC,7,0))))),\"\")","v":""},null,null,{"$f":"IFERROR(IF(AND($B$3=\"\",$H$3=\"\",$N$3=\"\",$B$5=\"\"),\"\",IF(AND($H$3=\"\",$N$3=\"\",$B$5=\"\"),VLOOKUP($B$3,'Banco de Dados'!$B:$AC,9,0),IF(AND($B$3=\"\",$N$3=\"\",$B$5=\"\"),VLOOKUP($H$3,'Banco de Dados'!$A:$AC,10,0),IF(AND($B$3=\"\",$H$3=\"\",$B$5=\"\"),VLOOKUP(Busca!$N$3,'Banco de Dados'!$D:$AC,7,0),VLOOKUP($B$5,'Banco de Dados'!$C:$AC,8,0))))),\"\")","v":""},null,null,{"$f":"IFERROR(IF(AND($B$3=\"\",$H$3=\"\",$N$3=\"\",$B$5=\"\"),\"\",IF(AND($H$3=\"\",$N$3=\"\",$B$5=\"\"),VLOOKUP($B$3,'Banco de Dados'!$B:$AC,10,0),IF(AND($B$3=\"\",$N$3=\"\",$B$5=\"\"),VLOOKUP($H$3,'Banco de Dados'!$A:$AC,11,0),IF(AND($B$3=\"\",$H$3=\"\",$B$5=\"\"),VLOOKUP(Busca!$N$3,'Banco de Dados'!$D:$AC,8,0),VLOOKUP($B$5,'Banco de Dados'!$C:$AC,9,0))))),\"\")","v":""},null,null,null,{"$f":"IFERROR(IF(AND($B$3=\"\",$H$3=\"\",$N$3=\"\",$B$5=\"\"),\"\",IF(AND($H$3=\"\",$N$3=\"\",$B$5=\"\"),VLOOKUP($B$3,'Banco de Dados'!$B:$AC,11,0),IF(AND($B$3=\"\",$N$3=\"\",$B$5=\"\"),VLOOKUP($H$3,'Banco de Dados'!$A:$AC,12,0),IF(AND($B$3=\"\",$H$3=\"\",$B$5=\"\"),VLOOKUP(Busca!$N$3,'Banco de Dados'!$D:$AC,9,0),VLOOKUP($B$5,'Banco de Dados'!$C:$AC,10,0))))),\"\")","v":""}]
[null,"Número:",null,null,"Complemento:",null,null,"Município:",null,null,null,null,null,"Bairro:"]
[null,{"$f":"IFERROR(IF(AND($B$3=\"\",$H$3=\"\",$N$3=\"\",$B$5=\"\"),\"\",IF(AND($H$3=\"\",$N$3=\"\",$B$5=\"\"),VLOOKUP($B$3,'Banco de Dados'!$B:$AC,12,0),IF(AND($B$3=\"\",$N$3=\"\",$B$5=\"\"),VLOOKUP($H$3,'Banco de Dados'!$A:$AC,13,0),IF(AND($B$3=\"\",$H$3=\"\",$B$5=\"\"),VLOOKUP(Busca!$N$3,'Banco de Dados'!$D:$AC,10,0),VLOOKUP($B$5,'Banco de Dados'!$C:$AC,11,0))))),\"\")","v":""},null,null,{"$f":"IFERROR(IF(AND($B$3=\"\",$H$3=\"\",$N$3=\"\",$B$5=\"\"),\"\",IF(AND($H$3=\"\",$N$3=\"\",$B$5=\"\"),VLOOKUP($B$3,'Banco de Dados'!$B:$AC,13,0),IF(AND($B$3=\"\",$N$3=\"\",$B$5=\"\"),VLOOKUP($H$3,'Banco de Dados'!$A:$AC,14,0),IF(AND($B$3=\"\",$H$3=\"\",$B$5=\"\"),VLOOKUP(Busca!$N$3,'Banco de Dados'!$D:$AC,11,0),VLOOKUP($B$5,'Banco de Dados'!$C:$AC,12,0))))),\"\")","v":""},null,null,{"$f":"IFERROR(IF(AND($B$3=\"\",$H$3=\"\",$N$3=\"\",$B$5=\"\"),\"\",IF(AND($H$3=\"\",$N$3=\"\",$B$5=\"\"),VLOOKUP($B$3,'Banco de Dados'!$B:$AC,14,0),IF(AND($B$3=\"\",$N$3=\"\",$B$5=\"\"),VLOOKUP($H$3,'Banco de Dados'!$A:$AC,15,0),IF(AND($B$3=\"\",$H$3=\"\",$B$5=\"\"),VLOOKUP(Busca!$N$3,'Banco de Dados'!$D:$AC,12,0),VLOOKUP($B$5,'Banco de Dados'!$C:$AC,13,0))))),\"\")","v":""},null,null,null,null,null,{"$f":"IFERROR(IF(AND($B$3=\"\",$H$3=\"\",$N$3=\"\",$B$5=\"\"),\"\",IF(AND($H$3=\"\",$N$3=\"\",$B$5=\"\"),VLOOKUP($B$3,'Banco de Dados'!$B:$AC,15,0),IF(AND($B$3=\"\",$N$3=\"\",$B$5=\"\"),VLOOKUP($H$3,'Banco de Dados'!$A:$AC,16,0),IF(AND($B$3=\"\",$H$3=\"\",$B$5=\"\"),VLOOKUP(Busca!$N$3,'Banco de Dados'!$D:$AC,13,0),VLOOKUP($B$5,'Banco de Dados'!$C:$AC,14,0))))),\"\")","v":""}]
[null,"UF:",null,null,"Cep:",null,null,"Telefone:",null,null,null,"Celular:",null,"Whatsapp:"]
[null,{"$f":"IFERROR(IF(AND($B$3=\"\",$H$3=\"\",$N$3=\"\",$B$5=\"\"),\"\",IF(AND($H$3=\"\",$N$3=\"\",$B$5=\"\"),VLOOKUP($B$3,'Banco de Dados'!$B:$AC,17,0),IF(AND($B$3=\"\",$N$3=\"\",$B$5=\"\"),VLOOKUP($H$3,'Banco de Dados'!$A:$AC,18,0),IF(AND($B$3=\"\",$H$3=\"\",$B$5=\"\"),VLOOKUP(Busca!$N$3,'Banco de Dados'!$D:$AC,15,0),VLOOKUP($B$5,'Banco de Dados'!$C:$AC,16,0))))),\"\")","v":""},null,null,{"$f":"IFERROR(IF(AND($B$3=\"\",$H$3=\"\",$N$3=\"\",$B$5=\"\"),\"\",IF(AND($H$3=\"\",$N$3=\"\",$B$5=\"\"),VLOOKUP($B$3,'Banco de Dados'!$B:$AC,16,0),IF(AND($B$3=\"\",$N$3=\"\",$B$5=\"\"),VLOOKUP($H$3,'Banco de Dados'!$A:$AC,17,0),IF(AND($B$3=\"\",$H$3=\"\",$B$5=\"\"),VLOOKUP(Busca!$N$3,'Banco de Dados'!$D:$AC,14,0),VLOOKUP($B$5,'Banco de Dados'!$C:$AC,15,0))))),\"\")","v":""},null,null,{"$f":"IFERROR(IF(AND($B$3=\"\",$H$3=\"\",$N$3=\"\",$B$5=\"\"),\"\",IF(AND($H$3=\"\",$N$3=\"\",$B$5=\"\"),VLOOKUP($B$3,'Banco de Dados'!$B:$AC,18,0),IF(AND($B$3=\"\",$N$3=\"\",$B$5=\"\"),VLOOKUP($H$3,'Banco de Dados'!$A:$AC,19,0),IF(AND($B$3=\"\",$H$3=\"\",$B$5=\"\"),VLOOKUP(Busca!$N$3,'Banco de Dados'!$D:$AC,16,0),VLOOKUP($B$5,'Banco de Dados'!$C:$AC,17,0))))),\"\")","v":""},null,null,null,{"$f":"IFERROR(IF(AND($B$3=\"\",$H$3=\"\",$N$3=\"\",$B$5=\"\"),\"\",IF(AND($H$3=\"\",$N$3=\"\",$B$5=\"\"),VLOOKUP($B$3,'Banco de Dados'!$B:$AC,19,0),IF(AND($B$3=\"\",$N$3=\"\",$B$5=\"\"),VLOOKUP($H$3,'Banco de Dados'!$A:$AC,20,0),IF(AND($B$3=\"\",$H$3=\"\",$B$5=\"\"),VLOOKUP(Busca!$N$3,'Banco de Dados'!$D:$AC,17,0),VLOOKUP($B$5,'Banco de Dados'!$C:$AC,18,0))))),\"\")","v":""},null,{"$f":"IFERROR(IF(AND($B$3=\"\",$H$3=\"\",$N$3=\"\",$B$5=\"\"),\"\",IF(AND($H$3=\"\",$N$3=\"\",$B$5=\"\"),VLOOKUP($B$3,'Banco de Dados'!$B:$AC,20,0),IF(AND($B$3=\"\",$N$3=\"\",$B$5=\"\"),VLOOKUP($H$3,'Banco de Dados'!$A:$AC,21,0),IF(AND($B$3=\"\",$H$3=\"\",$B$5=\"\"),VLOOKUP(Busca!$N$3,'Banco de Dados'!$D:$AC,18,0),VLOOKUP($B$5,'Banco de Dados'!$C:$AC,19,0))))),\"\")","v":""}]
[null,"E-mail:",null,null,null,null,null,"Cadastrado em:"]
[null,{"$f":"IFERROR(IF(AND($B$3=\"\",$H$3=\"\",$N$3=\"\",$B$5=\"\"),\"\",IF(AND($H$3=\"\",$N$3=\"\",$B$5=\"\"),VLOOKUP($B$3,'Banco de Dados'!$B:$AC,21,0),IF(AND($B$3=\"\",$N$3=\"\",$B$5=\"\"),VLOOKUP($H$3,'Banco de Dados'!$A:$AC,22,0),IF(AND($B$3=\"\",$H$3=\"\",$B$5=\"\"),VLOOKUP(Busca!$N$3,'Banco de Dados'!$D:$AC,19,0),VLOOKUP($B$5,'Banco de Dados'!$C:$AC,20,0))))),\"\")","v":""},null,null,null,null,null,{"$f":"IFERROR(IF(AND($B$3=\"\",$H$3=\"\",$N$3=\"\",$B$5=\"\"),\"\",IF(AND($H$3=\"\",$N$3=\"\",$B$5=\"\"),VLOOKUP($B$3,'Banco de Dados'!$B:$AC,22,0),IF(AND($B$3=\"\",$N$3=\"\",$B$5=\"\"),VLOOKUP($H$3,'Banco de Dados'!$A:$AC,23,0),IF(AND($B$3=\"\",$H$3=\"\",$B$5=\"\"),VLOOKUP(Busca!$N$3,'Banco de Dados'!$D:$AC,20,0),VLOOKUP($B$5,'Banco de Dados'!$C:$AC,21,0))))),\"\")","v":""}]
[null,"Observações:"]
[null,{"$f":"IFERROR(IF(AND($B$3=\"\",$H$3=\"\",$N$3=\"\",$B$5=\"\"),\"\",IF(AND($H$3=\"\",$N$3=\"\",$B$5=\"\"),VLOOKUP($B$3,'Banco de Dados'!$B:$AC,26,0),IF(AND($B$3=\"\",$N$3=\"\",$B$5=\"\"),VLOOKUP($H$3,'Banco de Dados'!$A:$AC,27,0),IF(AND($B$3=\"\",$H$3=\"\",$B$5=\"\"),VLOOKUP(Busca!$N$3,'Banco de Dados'!$D:$AC,24,0),VLOOKUP($B$5,'Banco de Dados'!$C:$AC,25,0))))),\"\")","v":""}]

{"sheet":"Banco de Dados","index":2,"n_rows":2,"n_cols":29,"rows_kept":2,"cut":false,"hidden":false,"merged":[]}
["CNPJ          ","CPF","Nome","Código","Sexo","Estado Civil","RG","Data de Nascimento","Nacionalidade","Naturalidade","UF","Endereço","Número","Complemento","Município","Bairro","CEP","UF","Telefone","Celular","Whatsapp","E-mail","Cadastrado em","CNPJ","CPF","Profissão","Observações","Código","Nome"]
[{"$f":"Cadastrar!O6","v":0},{"$f":"Cadastrar!K6","v":0},{"$f":"Cadastrar!G4","v":0},{"$f":"Cadastrar!O4","v":0},{"$f":"Cadastrar!S4","v":0},{"$f":"Cadastrar!Q4","v":0},{"$f":"Cadastrar!S6","v":0},{"$f":"Cadastrar!W2","v":"00"},{"$f":"Cadastrar!M9","v":0},{"$f":"Cadastrar!Q9","v":0},{"$f":"Cadastrar!U9","v":0},{"$f":"Cadastrar!B11","v":0},{"$f":"Cadastrar!K11","v":0},{"$f":"Cadastrar!O11","v":0},{"$f":"Cadastrar!B13","v":0},{"$f":"Cadastrar!K13","v":0},{"$f":"Cadastrar!O13","v":0},{"$f":"Cadastrar!U13","v":0},{"$f":"Cadastrar!B15","v":0},{"$f":"Cadastrar!F15","v":0},{"$f":"Cadastrar!K15","v":0},{"$f":"Cadastrar!O15","v":0},{"$f":"Cadastrar!S15","v":"00:00:00"},{"$f":"Cadastrar!O6","v":0},{"$f":"Cadastrar!K6","v":0},{"$f":"Cadastrar!G6","v":0},{"$f":"Cadastrar!B17","v":0},{"$f":"Cadastrar!O4","v":0},{"$f":"Cadastrar!G4","v":0}]

{"sheet":"Instruções","index":3,"n_rows":25,"n_cols":9,"rows_kept":25,"cut":false,"hidden":false,"merged":[[16,0,16,12],[18,0,18,12],[20,0,20,12],[22,0,22,12],[24,0,24,12],[0,0,1,12],[9,0,12,0],[14,0,14,12],[5,1,7,12],[9,1,12,12],[5,0,7,0]]}
["INSTRUÇÕES DE USO"]
[]
[]
[1,"Antes de utilizar a planilha, é necessário habilitar as macros. Confira o passo a passo neste vídeo >>",null,null,null,null,null,null,"https://youtu.be/nOrhtwX-Oac"]
[]
[2,"1. Insira os dados a serem cadastrados e clique em Cadastrar\n2. Para pesquisar os dados cadastrados clique no botão Pesquisar \n3. Para ir até o banco de dados clique em Banco de Dados\n4. Para limpar as células e realizar um novo cadastro clique em Limpar"]
[]
[]
[]
[3,"Para pesquisar algum cadastro você deverá inserir um dos critérios de pesquisa, CPF, CNPJ, Código ou Nome.\nImportante: Insira apenas um dos critérios\nPara a pesquisa insira o critério exatamente igual ao que foi cadastrado. Exemplo: Se você cadastrou João da SIlva, deverá pesquisar como João da SIlva e não apenas como João."]
[]
[]
[]
[]
["INFORMAÇÕES IMPORTANTES\t"]
[]
["Ao abrir o arquivo pela primeira vez, certifique-se de ter habilitado a Planilha para edição. Caso contrário, o Excel não permitirá que seja inserida informações na planilha."]
[]
["A Planilha de Cadastro de clientes é bloqueada para edição em sua estrutura por questões de direitos autorais. Não fornecemos senhas da planilha."]
[]
["Importante: Não realizamos alterações na planilha"]
[]
["Este modelo de Planilha foi desenvolvido e testado no Microsoft Excel para Windows. Não garantimos a compatibilidade com o Excel para MAC, Google Sheets, Excel para celular, tablet, ou qualquer outro software de Planilhas que não seja o Microsoft Excel para Windows."]
[]
["A Planilha de Cadastro de Grátis é disponibilizada exclusivamente no site oficial do desenvolvedor. O download de modelo não lhe garante o direito de comercializá-lo ou distribuí-la em outros sites. Qualquer violação de direitos autorais, será respondida judicialmente."]

{"sheet":"Plan3","index":4,"n_rows":112,"n_cols":7,"rows_kept":112,"cut":false,"hidden":true,"merged":[]}
[]
[]
[1,1,1910,"Feminino","Solteiro (a)","AC","AC"]
[2,2,1911,"Masculino","Casado (a)","AL","AL"]
[3,3,1912,null,"Divorciado (a)","AP","AP"]
[4,4,1913,null,"Viúvo (a)","AM","AM"]
[5,5,1914,null,null,"BA","BA"]
[6,6,1915,null,null,"CE","CE"]
[7,7,1916,null,null,"DF","DF"]
[8,8,1917,null,null,"ES","ES"]
[9,9,1918,null,null,"GO","GO"]
[10,10,1919,null,null,"MA","MA"]
[11,11,1920,null,null,"MT","MT"]
[12,12,1921,null,null,"MS","MS"]
[13,null,1922,null,null,"MG","MG"]
[14,null,1923,null,null,"PR","PR"]
[15,null,1924,null,null,"PB","PB"]
[16,null,1925,null,null,"PA","PA"]
[17,null,1926,null,null,"PE","PE"]
[18,null,1927,null,null,"PI","PI"]
[19,null,1928,null,null,"RJ","RJ"]
[20,null,1929,null,null,"RN","RN"]
[21,null,1930,null,null,"RS","RS"]
[22,null,1931,null,null,"RO","RO"]
[23,null,1932,null,null,"RR","RR"]
[24,null,1933,null,null,"SC","SC"]
[25,null,1934,null,null,"SE","SE"]
[26,null,1935,null,null,"SP","SP"]
[27,null,1936,null,null,"TO","TO"]
[28,null,1937]
[29,null,1938]
[30,null,1939]
[31,null,1940]
[null,null,1941]
[null,null,1942]
[null,null,1943]
[null,null,1944]
[null,null,1945]
[null,null,1946]
[null,null,1947]
[null,null,1948]
[null,null,1949]
[null,null,1950]
[null,null,1951]
[null,null,1952]
[null,null,1953]
[null,null,1954]
[null,null,1955]
[null,null,1956]
[null,null,1957]
[null,null,1958]
[null,null,1959]
[null,null,1960]
[null,null,1961]
[null,null,1962]
[null,null,1963]
[null,null,1964]
[null,null,1965]
[null,null,1966]
[null,null,1967]
[null,null,1968]
[null,null,1969]
[null,null,1970]
[null,null,1971]
[null,null,1972]
[null,null,1973]
[null,null,1974]
[null,null,1975]
[null,null,1976]
[null,null,1977]
[null,null,1978]
[null,null,1979]
[null,null,1980]
[null,null,1981]
[null,null,1982]
[null,null,1983]
[null,null,1984]
[null,null,1985]
[null,null,1986]
[null,null,1987]
[null,null,1988]
[null,null,1989]
[null,null,1990]
[null,null,1991]
[null,null,1992]
[null,null,1993]
[null,null,1994]
[null,null,1995]
[null,null,1996]
[null,null,1997]
[null,null,1998]
[null,null,1999]
[null,null,2000]
[null,null,2001]
[null,null,2002]
[null,null,2003]
[null,null,2004]
[null,null,2005]
[null,null,2006]
[null,null,2007]
[null,null,2008]
[null,null,2009]
[null,null,2010]
[null,null,2011]
[null,null,2012]
[null,null,2013]
[null,null,2014]
[null,null,2015]
[null,null,2016]
[null,null,2017]
[null,null,2018]
[null,null,2019]