{"text_format":"1","workbook":"xlsx","n_sheets":4,"sheets":["Menu","Lista de Produtos","Comparativo","Lista Menores Preços"],"not_rendered":{"charts":0,"images":5,"macros":1,"external_links":0,"defined_names":7,"comments":0,"pivot_tables":0},"unopened":[],"bounds":{"document_bytes":16777216,"sheet_cells":100000,"rows_first":2000,"rows_last":500,"rows_between":2000,"halvings":0,"cell_chars":16384,"cell_head_chars":4096},"cells_cut":0,"cells_raw":0,"read":"whole","date_system":"1900"}

{"sheet":"Menu","index":0,"n_rows":0,"n_cols":0,"rows_kept":0,"cut":false,"hidden":false,"merged":[]}

{"sheet":"Lista de Produtos","index":1,"n_rows":31,"n_cols":11,"rows_kept":31,"cut":false,"hidden":false,"merged":[]}
["Produto","Mercado 1","Mercado 2","Menor Preço","Local Menor Preço",null,null,null,{"$f":"B1","v":"Mercado 1"}]
["Arroz",10,10.5,{"$f":"IFERROR(SMALL(B2:C2,1),\"\")","v":10},{"$f":"IFERROR(IF(MATCH(D2,B2:C2,0)=1,\"Mercado 1\",IF(MATCH(D2,B2:C2,0)=2,\"Mercado 2\",IF(MATCH(D2,B2:C2,0)=3,\"Mercado 3\",\"Mercado 4\"))),\"\")","v":"Mercado 1"},null,null,null,{"$f":"C1","v":"Mercado 2"}]
["Feijão",5.5,6,{"$f":"IFERROR(SMALL(B3:C3,1),\"\")","v":5.5},{"$f":"IFERROR(IF(MATCH(D3,B3:C3,0)=1,\"Mercado 1\",IF(MATCH(D3,B3:C3,0)=2,\"Mercado 2\",IF(MATCH(D3,B3:C3,0)=3,\"Mercado 3\",\"Mercado 4\"))),\"\")","v":"Mercado 1"}]
["Farinha",4.9000000000000004,4,4,"Mercado 2"]
["Farofa",2.9,4,2.9,"Mercado 1"]
["Banana",1,4,1,"Mercado 1"]
["Laranja",4.9000000000000004,4,4,"Mercado 2"]
["Desinfetante",4.9000000000000004,4,4,"Mercado 2"]
["Amaciante",4.9000000000000004,4,4,"Mercado 2"]
["Sabão em Pó",4.9000000000000004,4,4,"Mercado 2",null,null,null,null,null,""]
["Papel higiênico",4.9000000000000004,4,4,"Mercado 2"]
["Detergente",4.9000000000000004,4,4,"Mercado 2"]
["Sabonete",4.9000000000000004,4,4,"Mercado 2"]
["Creme Dental",4.9000000000000004,4,4,"Mercado 2"]
["Fio Dental",4.9000000000000004,4,4,"Mercado 2"]
[null,null,null,"",""]
[null,null,null,"",""]
[null,null,null,"",""]
[null,null,null,"",""]
[null,null,null,"",""]
[null,null,null,"",""]
[null,null,null,"",""]
[null,null,null,"",""]
[null,null,null,"",""]
[null,null,null,"",""]
[null,null,null,"",""]
[null,null,null,"",""]
[null,null,null,"",""]
[null,null,null,"",""]
[null,null,null,"",""]
[null,null,null,{"$f":"IFERROR(SMALL(B31:C31,1),\"\")","v":""},{"$f":"IFERROR(IF(MATCH(D31,B31:C31,0)=1,\"Mercado 1\",IF(MATCH(D31,B31:C31,0)=2,\"Mercado 2\",IF(MATCH(D31,B31:C31,0)=3,\"Mercado 3\",\"Mercado 4\"))),\"\")","v":""}]

{"sheet":"Comparativo","index":2,"n_rows":41,"n_cols":8,"rows_kept":41,"cut":false,"hidden":false,"merged":[]}
[null,null,null,null,null,{"$f":"COUNTA(A11:A1006)-COUNTBLANK(A11:A41)","v":14},null,1]
[]
[]
[null,null,null,"Total da Compra",null,null,null,"Produto"]
["Selecione um Fornecedor:",{"$f":"IF(C5=1,'Lista de Produtos'!B1,IF(C5=2,'Lista de Produtos'!C1,IF(C5=3,'Lista de Produtos'!D1,IF(C5=4,'Lista de Produtos'!E1))))","v":"Mercado 1"},1,{"$f":"SUM(D11:D1006)","v":156.70000000000002},null,null,null,{"$f":"IFERROR(INDEX(A11:A1006,H1),\"\")","v":"Arroz"}]
[]
[null,null,null,"Total de Itens",null,null,null,"Menor Preço"]
[null,null,null,{"$f":"SUM(C11:C1006)","v":33},null,null,null,{"$f":"IFERROR(VLOOKUP(H5,'Lista de Produtos'!A2:E31,4,0),\"\")","v":10}]
[null,null,{"$f":"MATCH(B5,mercados,0)","v":1},null,null,null,null,"Local de Menor Preço"]
["Produto","Preço Un","Quantidade","Total",null,null,null,{"$f":"IFERROR(VLOOKUP(H5,'Lista de Produtos'!A2:E31,5,0),\"\")","v":"Mercado 1"}]
[{"$f":"IF('Lista de Produtos'!A2=\"\",\"\",'Lista de Produtos'!A2)","v":"Arroz"},{"$f":"IFERROR(IF($C$9=1,VLOOKUP(A11,'Lista de Produtos'!A2:E15,2,0),IF($C$9=2,VLOOKUP(A11,'Lista de Produtos'!A2:E15,3,0),IF($C$9=3,VLOOKUP(A11,'Lista de Produtos'!A2:E15,4,0),IF($C$9=4,VLOOKUP(A11,'Lista de Produtos'!A2:E15,5,0))))),\"\")","v":10},2,{"$f":"IFERROR(IF(B11=\"\",\"\",B11*C11),\"\")","v":20}]
[{"$f":"IF('Lista de Produtos'!A3=\"\",\"\",'Lista de Produtos'!A3)","v":"Feijão"},{"$f":"IFERROR(IF($C$9=1,VLOOKUP(A12,'Lista de Produtos'!A3:E16,2,0),IF($C$9=2,VLOOKUP(A12,'Lista de Produtos'!A3:E16,3,0),IF($C$9=3,VLOOKUP(A12,'Lista de Produtos'!A3:E16,4,0),IF($C$9=4,VLOOKUP(A12,'Lista de Produtos'!A3:E16,5,0))))),\"\")","v":5.5},1,{"$f":"IFERROR(IF(B12=\"\",\"\",B12*C12),\"\")","v":5.5}]
[{"$f":"IF('Lista de Produtos'!A4=\"\",\"\",'Lista de Produtos'!A4)","v":"Farinha"},{"$f":"IFERROR(IF($C$9=1,VLOOKUP(A13,'Lista de Produtos'!A4:E17,2,0),IF($C$9=2,VLOOKUP(A13,'Lista de Produtos'!A4:E17,3,0),IF($C$9=3,VLOOKUP(A13,'Lista de Produtos'!A4:E17,4,0),IF($C$9=4,VLOOKUP(A13,'Lista de Produtos'!A4:E17,5,0))))),\"\")","v":4.9000000000000004},3,14.700000000000001,null,null,null,{"$f":"'Lista de Produtos'!B1","v":"Mercado 1"}]
[{"$f":"IF('Lista de Produtos'!A5=\"\",\"\",'Lista de Produtos'!A5)","v":"Farofa"},{"$f":"IFERROR(IF($C$9=1,VLOOKUP(A14,'Lista de Produtos'!A5:E18,2,0),IF($C$9=2,VLOOKUP(A14,'Lista de Produtos'!A5:E18,3,0),IF($C$9=3,VLOOKUP(A14,'Lista de Produtos'!A5:E18,4,0),IF($C$9=4,VLOOKUP(A14,'Lista de Produtos'!A5:E18,5,0))))),\"\")","v":2.9},4,11.6,null,null,null,{"$f":"SUMPRODUCT(C11:C1011,'Lista de Produtos'!B2:B1002)","v":156.70000000000002}]
[{"$f":"IF('Lista de Produtos'!A6=\"\",\"\",'Lista de Produtos'!A6)","v":"Banana"},{"$f":"IFERROR(IF($C$9=1,VLOOKUP(A15,'Lista de Produtos'!A6:E19,2,0),IF($C$9=2,VLOOKUP(A15,'Lista de Produtos'!A6:E19,3,0),IF($C$9=3,VLOOKUP(A15,'Lista de Produtos'!A6:E19,4,0),IF($C$9=4,VLOOKUP(A15,'Lista de Produtos'!A6:E19,5,0))))),\"\")","v":1},2,2,null,null,null,{"$f":"'Lista de Produtos'!C1","v":"Mercado 2"}]
[{"$f":"IF('Lista de Produtos'!A7=\"\",\"\",'Lista de Produtos'!A7)","v":"Laranja"},{"$f":"IFERROR(IF($C$9=1,VLOOKUP(A16,'Lista de Produtos'!A7:E20,2,0),IF($C$9=2,VLOOKUP(A16,'Lista de Produtos'!A7:E20,3,0),IF($C$9=3,VLOOKUP(A16,'Lista de Produtos'!A7:E20,4,0),IF($C$9=4,VLOOKUP(A16,'Lista de Produtos'!A7:E20,5,0))))),\"\")","v":4.9000000000000004},4,19.600000000000001,null,null,null,{"$f":"SUMPRODUCT(C11:C1011,'Lista de Produtos'!C2:C1002)","v":147}]
[{"$f":"IF('Lista de Produtos'!A8=\"\",\"\",'Lista de Produtos'!A8)","v":"Desinfetante"},{"$f":"IFERROR(IF($C$9=1,VLOOKUP(A17,'Lista de Produtos'!A8:E21,2,0),IF($C$9=2,VLOOKUP(A17,'Lista de Produtos'!A8:E21,3,0),IF($C$9=3,VLOOKUP(A17,'Lista de Produtos'!A8:E21,4,0),IF($C$9=4,VLOOKUP(A17,'Lista de Produtos'!A8:E21,5,0))))),\"\")","v":4.9000000000000004},2,9.8000000000000007]
[{"$f":"IF('Lista de Produtos'!A9=\"\",\"\",'Lista de Produtos'!A9)","v":"Amaciante"},{"$f":"IFERROR(IF($C$9=1,VLOOKUP(A18,'Lista de Produtos'!A9:E22,2,0),IF($C$9=2,VLOOKUP(A18,'Lista de Produtos'!A9:E22,3,0),IF($C$9=3,VLOOKUP(A18,'Lista de Produtos'!A9:E22,4,0),IF($C$9=4,VLOOKUP(A18,'Lista de Produtos'!A9:E22,5,0))))),\"\")","v":4.9000000000000004},3,14.700000000000001]
[{"$f":"IF('Lista de Produtos'!A10=\"\",\"\",'Lista de Produtos'!A10)","v":"Sabão em Pó"},{"$f":"IFERROR(IF($C$9=1,VLOOKUP(A19,'Lista de Produtos'!A10:E23,2,0),IF($C$9=2,VLOOKUP(A19,'Lista de Produtos'!A10:E23,3,0),IF($C$9=3,VLOOKUP(A19,'Lista de Produtos'!A10:E23,4,0),IF($C$9=4,VLOOKUP(A19,'Lista de Produtos'!A10:E23,5,0))))),\"\")","v":4.9000000000000004},2,9.8000000000000007]
[{"$f":"IF('Lista de Produtos'!A11=\"\",\"\",'Lista de Produtos'!A11)","v":"Papel higiênico"},{"$f":"IFERROR(IF($C$9=1,VLOOKUP(A20,'Lista de Produtos'!A11:E24,2,0),IF($C$9=2,VLOOKUP(A20,'Lista de Produtos'!A11:E24,3,0),IF($C$9=3,VLOOKUP(A20,'Lista de Produtos'!A11:E24,4,0),IF($C$9=4,VLOOKUP(A20,'Lista de Produtos'!A11:E24,5,0))))),\"\")","v":4.9000000000000004},2,9.8000000000000007]
[{"$f":"IF('Lista de Produtos'!A12=\"\",\"\",'Lista de Produtos'!A12)","v":"Detergente"},{"$f":"IFERROR(IF($C$9=1,VLOOKUP(A21,'Lista de Produtos'!A12:E25,2,0),IF($C$9=2,VLOOKUP(A21,'Lista de Produtos'!A12:E25,3,0),IF($C$9=3,VLOOKUP(A21,'Lista de Produtos'!A12:E25,4,0),IF($C$9=4,VLOOKUP(A21,'Lista de Produtos'!A12:E25,5,0))))),\"\")","v":4.9000000000000004},2,9.8000000000000007]
[{"$f":"IF('Lista de Produtos'!A13=\"\",\"\",'Lista de Produtos'!A13)","v":"Sabonete"},{"$f":"IFERROR(IF($C$9=1,VLOOKUP(A22,'Lista de Produtos'!A13:E26,2,0),IF($C$9=2,VLOOKUP(A22,'Lista de Produtos'!A13:E26,3,0),IF($C$9=3,VLOOKUP(A22,'Lista de Produtos'!A13:E26,4,0),IF($C$9=4,VLOOKUP(A22,'Lista de Produtos'!A13:E26,5,0))))),\"\")","v":4.9000000000000004},2,9.8000000000000007]
[{"$f":"IF('Lista de Produtos'!A14=\"\",\"\",'Lista de Produtos'!A14)","v":"Creme Dental"},{"$f":"IFERROR(IF($C$9=1,VLOOKUP(A23,'Lista de Produtos'!A14:E27,2,0),IF($C$9=2,VLOOKUP(A23,'Lista de Produtos'!A14:E27,3,0),IF($C$9=3,VLOOKUP(A23,'Lista de Produtos'!A14:E27,4,0),IF($C$9=4,VLOOKUP(A23,'Lista de Produtos'!A14:E27,5,0))))),\"\")","v":4.9000000000000004},2,9.8000000000000007]
[{"$f":"IF('Lista de Produtos'!A15=\"\",\"\",'Lista de Produtos'!A15)","v":"Fio Dental"},{"$f":"IFERROR(IF($C$9=1,VLOOKUP(A24,'Lista de Produtos'!A15:E28,2,0),IF($C$9=2,VLOOKUP(A24,'Lista de Produtos'!A15:E28,3,0),IF($C$9=3,VLOOKUP(A24,'Lista de Produtos'!A15:E28,4,0),IF($C$9=4,VLOOKUP(A24,'Lista de Produtos'!A15:E28,5,0))))),\"\")","v":4.9000000000000004},2,9.8000000000000007]
[{"$f":"IF('Lista de Produtos'!A16=\"\",\"\",'Lista de Produtos'!A16)","v":""},{"$f":"IFERROR(IF($C$9=1,VLOOKUP(A25,'Lista de Produtos'!A16:E29,2,0),IF($C$9=2,VLOOKUP(A25,'Lista de Produtos'!A16:E29,3,0),IF($C$9=3,VLOOKUP(A25,'Lista de Produtos'!A16:E29,4,0),IF($C$9=4,VLOOKUP(A25,'Lista de Produtos'!A16:E29,5,0))))),\"\")","v":""},null,""]
[{"$f":"IF('Lista de Produtos'!A17=\"\",\"\",'Lista de Produtos'!A17)","v":""},{"$f":"IFERROR(IF($C$9=1,VLOOKUP(A26,'Lista de Produtos'!A17:E30,2,0),IF($C$9=2,VLOOKUP(A26,'Lista de Produtos'!A17:E30,3,0),IF($C$9=3,VLOOKUP(A26,'Lista de Produtos'!A17:E30,4,0),IF($C$9=4,VLOOKUP(A26,'Lista de Produtos'!A17:E30,5,0))))),\"\")","v":""},null,""]
[{"$f":"IF('Lista de Produtos'!A18=\"\",\"\",'Lista de Produtos'!A18)","v":""},{"$f":"IFERROR(IF($C$9=1,VLOOKUP(A27,'Lista de Produtos'!A18:E31,2,0),IF($C$9=2,VLOOKUP(A27,'Lista de Produtos'!A18:E31,3,0),IF($C$9=3,VLOOKUP(A27,'Lista de Produtos'!A18:E31,4,0),IF($C$9=4,VLOOKUP(A27,'Lista de Produtos'!A18:E31,5,0))))),\"\")","v":""},null,""]
[{"$f":"IF('Lista de Produtos'!A19=\"\",\"\",'Lista de Produtos'!A19)","v":""},{"$f":"IFERROR(IF($C$9=1,VLOOKUP(A28,'Lista de Produtos'!A19:E32,2,0),IF($C$9=2,VLOOKUP(A28,'Lista de Produtos'!A19:E32,3,0),IF($C$9=3,VLOOKUP(A28,'Lista de Produtos'!A19:E32,4,0),IF($C$9=4,VLOOKUP(A28,'Lista de Produtos'!A19:E32,5,0))))),\"\")","v":""},null,""]
[{"$f":"IF('Lista de Produtos'!A20=\"\",\"\",'Lista de Produtos'!A20)","v":""},{"$f":"IFERROR(IF($C$9=1,VLOOKUP(A29,'Lista de Produtos'!A20:E33,2,0),IF($C$9=2,VLOOKUP(A29,'Lista de Produtos'!A20:E33,3,0),IF($C$9=3,VLOOKUP(A29,'Lista de Produtos'!A20:E33,4,0),IF($C$9=4,VLOOKUP(A29,'Lista de Produtos'!A20:E33,5,0))))),\"\")","v":""},null,""]
[{"$f":"IF('Lista de Produtos'!A21=\"\",\"\",'Lista de Produtos'!A21)","v":""},{"$f":"IFERROR(IF($C$9=1,VLOOKUP(A30,'Lista de Produtos'!A21:E34,2,0),IF($C$9=2,VLOOKUP(A30,'Lista de Produtos'!A21:E34,3,0),IF($C$9=3,VLOOKUP(A30,'Lista de Produtos'!A21:E34,4,0),IF($C$9=4,VLOOKUP(A30,'Lista de Produtos'!A21:E34,5,0))))),\"\")","v":""},null,""]
[{"$f":"IF('Lista de Produtos'!A22=\"\",\"\",'Lista de Produtos'!A22)","v":""},{"$f":"IFERROR(IF($C$9=1,VLOOKUP(A31,'Lista de Produtos'!A22:E35,2,0),IF($C$9=2,VLOOKUP(A31,'Lista de Produtos'!A22:E35,3,0),IF($C$9=3,VLOOKUP(A31,'Lista de Produtos'!A22:E35,4,0),IF($C$9=4,VLOOKUP(A31,'Lista de Produtos'!A22:E35,5,0))))),\"\")","v":""},null,""]
[{"$f":"IF('Lista de Produtos'!A23=\"\",\"\",'Lista de Produtos'!A23)","v":""},{"$f":"IFERROR(IF($C$9=1,VLOOKUP(A32,'Lista de Produtos'!A23:E36,2,0),IF($C$9=2,VLOOKUP(A32,'Lista de Produtos'!A23:E36,3,0),IF($C$9=3,VLOOKUP(A32,'Lista de Produtos'!A23:E36,4,0),IF($C$9=4,VLOOKUP(A32,'Lista de Produtos'!A23:E36,5,0))))),\"\")","v":""},null,""]
[{"$f":"IF('Lista de Produtos'!A24=\"\",\"\",'Lista de Produtos'!A24)","v":""},{"$f":"IFERROR(IF($C$9=1,VLOOKUP(A33,'Lista de Produtos'!A24:E37,2,0),IF($C$9=2,VLOOKUP(A33,'Lista de Produtos'!A24:E37,3,0),IF($C$9=3,VLOOKUP(A33,'Lista de Produtos'!A24:E37,4,0),IF($C$9=4,VLOOKUP(A33,'Lista de Produtos'!A24:E37,5,0))))),\"\")","v":""},null,""]
[{"$f":"IF('Lista de Produtos'!A25=\"\",\"\",'Lista de Produtos'!A25)","v":""},{"$f":"IFERROR(IF($C$9=1,VLOOKUP(A34,'Lista de Produtos'!A25:E38,2,0),IF($C$9=2,VLOOKUP(A34,'Lista de Produtos'!A25:E38,3,0),IF($C$9=3,VLOOKUP(A34,'Lista de Produtos'!A25:E38,4,0),IF($C$9=4,VLOOKUP(A34,'Lista de Produtos'!A25:E38,5,0))))),\"\")","v":""},null,""]
[{"$f":"IF('Lista de Produtos'!A26=\"\",\"\",'Lista de Produtos'!A26)","v":""},{"$f":"IFERROR(IF($C$9=1,VLOOKUP(A35,'Lista de Produtos'!A26:E39,2,0),IF($C$9=2,VLOOKUP(A35,'Lista de Produtos'!A26:E39,3,0),IF($C$9=3,VLOOKUP(A35,'Lista de Produtos'!A26:E39,4,0),IF($C$9=4,VLOOKUP(A35,'Lista de Produtos'!A26:E39,5,0))))),\"\")","v":""},null,""]
[{"$f":"IF('Lista de Produtos'!A27=\"\",\"\",'Lista de Produtos'!A27)","v":""},{"$f":"IFERROR(IF($C$9=1,VLOOKUP(A36,'Lista de Produtos'!A27:E40,2,0),IF($C$9=2,VLOOKUP(A36,'Lista de Produtos'!A27:E40,3,0),IF($C$9=3,VLOOKUP(A36,'Lista de Produtos'!A27:E40,4,0),IF($C$9=4,VLOOKUP(A36,'Lista de Produtos'!A27:E40,5,0))))),\"\")","v":""},null,""]
[{"$f":"IF('Lista de Produtos'!A28=\"\",\"\",'Lista de Produtos'!A28)","v":""},{"$f":"IFERROR(IF($C$9=1,VLOOKUP(A37,'Lista de Produtos'!A28:E41,2,0),IF($C$9=2,VLOOKUP(A37,'Lista de Produtos'!A28:E41,3,0),IF($C$9=3,VLOOKUP(A37,'Lista de Produtos'!A28:E41,4,0),IF($C$9=4,VLOOKUP(A37,'Lista de Produtos'!A28:E41,5,0))))),\"\")","v":""},null,""]
[{"$f":"IF('Lista de Produtos'!A29=\"\",\"\",'Lista de Produtos'!A29)","v":""},{"$f":"IFERROR(IF($C$9=1,VLOOKUP(A38,'Lista de Produtos'!A29:E42,2,0),IF($C$9=2,VLOOKUP(A38,'Lista de Produtos'!A29:E42,3,0),IF($C$9=3,VLOOKUP(A38,'Lista de Produtos'!A29:E42,4,0),IF($C$9=4,VLOOKUP(A38,'Lista de Produtos'!A29:E42,5,0))))),\"\")","v":""},null,""]
[{"$f":"IF('Lista de Produtos'!A30=\"\",\"\",'Lista de Produtos'!A30)","v":""},{"$f":"IFERROR(IF($C$9=1,VLOOKUP(A39,'Lista de Produtos'!A30:E43,2,0),IF($C$9=2,VLOOKUP(A39,'Lista de Produtos'!A30:E43,3,0),IF($C$9=3,VLOOKUP(A39,'Lista de Produtos'!A30:E43,4,0),IF($C$9=4,VLOOKUP(A39,'Lista de Produtos'!A30:E43,5,0))))),\"\")","v":""},null,""]
[{"$f":"IF('Lista de Produtos'!A31=\"\",\"\",'Lista de Produtos'!A31)","v":""},{"$f":"IFERROR(IF($C$9=1,VLOOKUP(A40,'Lista de Produtos'!A31:E44,2,0),IF($C$9=2,VLOOKUP(A40,'Lista de Produtos'!A31:E44,3,0),IF($C$9=3,VLOOKUP(A40,'Lista de Produtos'!A31:E44,4,0),IF($C$9=4,VLOOKUP(A40,'Lista de Produtos'!A31:E44,5,0))))),\"\")","v":""},null,""]
[{"$f":"IF('Lista de Produtos'!A32=\"\",\"\",'Lista de Produtos'!A32)","v":""},{"$f":"IFERROR(IF($C$9=1,VLOOKUP(A41,'Lista de Produtos'!A32:E45,2,0),IF($C$9=2,VLOOKUP(A41,'Lista de Produtos'!A32:E45,3,0),IF($C$9=3,VLOOKUP(A41,'Lista de Produtos'!A32:E45,4,0),IF($C$9=4,VLOOKUP(A41,'Lista de Produtos'!A32:E45,5,0))))),\"\")","v":""},null,""]

{"sheet":"Lista Menores Preços","index":3,"n_rows":39,"n_cols":6,"rows_kept":39,"cut":false,"hidden":false,"merged":[[3,0,3,4]]}
[null,null,null,null,null,{"$f":"COUNTA(A9:A1007)-COUNTBLANK(A9:A39)","v":14}]
[]
[]
["Lista de compras (Produtos com melhor preço)"]
[null,null,null,"Total de Itens",{"$f":"SUM(C9:C22)","v":33}]
[null,null,null,"Total da compra",{"$f":"SUM(D9:D22)","v":135.1}]
[]
["Produto","Menor Preço","Quantidade","Total","Local de Menor Preço"]
[{"$f":"IF(Comparativo!A11=\"\",\"\",Comparativo!A11)","v":"Arroz"},{"$f":"IF('Lista de Produtos'!D2=\"\",\"\",'Lista de Produtos'!D2)","v":10},{"$f":"IF(Comparativo!C11=\"\",\"\",Comparativo!C11)","v":2},{"$f":"IFERROR(B9*C9,\"\")","v":20},{"$f":"IF('Lista de Produtos'!E2=\"\",\"\",'Lista de Produtos'!E2)","v":"Mercado 1"}]
[{"$f":"IF(Comparativo!A12=\"\",\"\",Comparativo!A12)","v":"Feijão"},{"$f":"IF('Lista de Produtos'!D3=\"\",\"\",'Lista de Produtos'!D3)","v":5.5},{"$f":"IF(Comparativo!C12=\"\",\"\",Comparativo!C12)","v":1},{"$f":"IFERROR(B10*C10,\"\")","v":5.5},{"$f":"IF('Lista de Produtos'!E3=\"\",\"\",'Lista de Produtos'!E3)","v":"Mercado 1"}]
[{"$f":"IF(Comparativo!A13=\"\",\"\",Comparativo!A13)","v":"Farinha"},{"$f":"IF('Lista de Produtos'!D4=\"\",\"\",'Lista de Produtos'!D4)","v":4},{"$f":"IF(Comparativo!C13=\"\",\"\",Comparativo!C13)","v":3},12,{"$f":"IF('Lista de Produtos'!E4=\"\",\"\",'Lista de Produtos'!E4)","v":"Mercado 2"}]
[{"$f":"IF(Comparativo!A14=\"\",\"\",Comparativo!A14)","v":"Farofa"},{"$f":"IF('Lista de Produtos'!D5=\"\",\"\",'Lista de Produtos'!D5)","v":2.9},{"$f":"IF(Comparativo!C14=\"\",\"\",Comparativo!C14)","v":4},11.6,{"$f":"IF('Lista de Produtos'!E5=\"\",\"\",'Lista de Produtos'!E5)","v":"Mercado 1"}]
[{"$f":"IF(Comparativo!A15=\"\",\"\",Comparativo!A15)","v":"Banana"},{"$f":"IF('Lista de Produtos'!D6=\"\",\"\",'Lista de Produtos'!D6)","v":1},{"$f":"IF(Comparativo!C15=\"\",\"\",Comparativo!C15)","v":2},2,{"$f":"IF('Lista de Produtos'!E6=\"\",\"\",'Lista de Produtos'!E6)","v":"Mercado 1"}]
[{"$f":"IF(Comparativo!A16=\"\",\"\",Comparativo!A16)","v":"Laranja"},{"$f":"IF('Lista de Produtos'!D7=\"\",\"\",'Lista de Produtos'!D7)","v":4},{"$f":"IF(Comparativo!C16=\"\",\"\",Comparativo!C16)","v":4},16,{"$f":"IF('Lista de Produtos'!E7=\"\",\"\",'Lista de Produtos'!E7)","v":"Mercado 2"}]
[{"$f":"IF(Comparativo!A17=\"\",\"\",Comparativo!A17)","v":"Desinfetante"},{"$f":"IF('Lista de Produtos'!D8=\"\",\"\",'Lista de Produtos'!D8)","v":4},{"$f":"IF(Comparativo!C17=\"\",\"\",Comparativo!C17)","v":2},8,{"$f":"IF('Lista de Produtos'!E8=\"\",\"\",'Lista de Produtos'!E8)","v":"Mercado 2"}]
[{"$f":"IF(Comparativo!A18=\"\",\"\",Comparativo!A18)","v":"Amaciante"},{"$f":"IF('Lista de Produtos'!D9=\"\",\"\",'Lista de Produtos'!D9)","v":4},{"$f":"IF(Comparativo!C18=\"\",\"\",Comparativo!C18)","v":3},12,{"$f":"IF('Lista de Produtos'!E9=\"\",\"\",'Lista de Produtos'!E9)","v":"Mercado 2"}]
[{"$f":"IF(Comparativo!A19=\"\",\"\",Comparativo!A19)","v":"Sabão em Pó"},{"$f":"IF('Lista de Produtos'!D10=\"\",\"\",'Lista de Produtos'!D10)","v":4},{"$f":"IF(Comparativo!C19=\"\",\"\",Comparativo!C19)","v":2},8,{"$f":"IF('Lista de Produtos'!E10=\"\",\"\",'Lista de Produtos'!E10)","v":"Mercado 2"}]
[{"$f":"IF(Comparativo!A20=\"\",\"\",Comparativo!A20)","v":"Papel higiênico"},{"$f":"IF('Lista de Produtos'!D11=\"\",\"\",'Lista de Produtos'!D11)","v":4},{"$f":"IF(Comparativo!C20=\"\",\"\",Comparativo!C20)","v":2},8,{"$f":"IF('Lista de Produtos'!E11=\"\",\"\",'Lista de Produtos'!E11)","v":"Mercado 2"}]
[{"$f":"IF(Comparativo!A21=\"\",\"\",Comparativo!A21)","v":"Detergente"},{"$f":"IF('Lista de Produtos'!D12=\"\",\"\",'Lista de Produtos'!D12)","v":4},{"$f":"IF(Comparativo!C21=\"\",\"\",Comparativo!C21)","v":2},8,{"$f":"IF('Lista de Produtos'!E12=\"\",\"\",'Lista de Produtos'!E12)","v":"Mercado 2"}]
[{"$f":"IF(Comparativo!A22=\"\",\"\",Comparativo!A22)","v":"Sabonete"},{"$f":"IF('Lista de Produtos'!D13=\"\",\"\",'Lista de Produtos'!D13)","v":4},{"$f":"IF(Comparativo!C22=\"\",\"\",Comparativo!C22)","v":2},8,{"$f":"IF('Lista de Produtos'!E13=\"\",\"\",'Lista de Produtos'!E13)","v":"Mercado 2"}]
[{"$f":"IF(Comparativo!A23=\"\",\"\",Comparativo!A23)","v":"Creme Dental"},{"$f":"IF('Lista de Produtos'!D14=\"\",\"\",'Lista de Produtos'!D14)","v":4},{"$f":"IF(Comparativo!C23=\"\",\"\",Comparativo!C23)","v":2},8,{"$f":"IF('Lista de Produtos'!E14=\"\",\"\",'Lista de Produtos'!E14)","v":"Mercado 2"}]
[{"$f":"IF(Comparativo!A24=\"\",\"\",Comparativo!A24)","v":"Fio Dental"},{"$f":"IF('Lista de Produtos'!D15=\"\",\"\",'Lista de Produtos'!D15)","v":4},{"$f":"IF(Comparativo!C24=\"\",\"\",Comparativo!C24)","v":2},8,{"$f":"IF('Lista de Produtos'!E15=\"\",\"\",'Lista de Produtos'!E15)","v":"Mercado 2"}]
[{"$f":"IF(Comparativo!A25=\"\",\"\",Comparativo!A25)","v":""},{"$f":"IF('Lista de Produtos'!D16=\"\",\"\",'Lista de Produtos'!D16)","v":""},{"$f":"IF(Comparativo!C25=\"\",\"\",Comparativo!C25)","v":""},"",{"$f":"IF('Lista de Produtos'!E16=\"\",\"\",'Lista de Produtos'!E16)","v":""}]
[{"$f":"IF(Comparativo!A26=\"\",\"\",Comparativo!A26)","v":""},{"$f":"IF('Lista de Produtos'!D17=\"\",\"\",'Lista de Produtos'!D17)","v":""},{"$f":"IF(Comparativo!C26=\"\",\"\",Comparativo!C26)","v":""},"",{"$f":"IF('Lista de Produtos'!E17=\"\",\"\",'Lista de Produtos'!E17)","v":""}]
[{"$f":"IF(Comparativo!A27=\"\",\"\",Comparativo!A27)","v":""},{"$f":"IF('Lista de Produtos'!D18=\"\",\"\",'Lista de Produtos'!D18)","v":""},{"$f":"IF(Comparativo!C27=\"\",\"\",Comparativo!C27)","v":""},"",{"$f":"IF('Lista de Produtos'!E18=\"\",\"\",'Lista de Produtos'!E18)","v":""}]
[{"$f":"IF(Comparativo!A28=\"\",\"\",Comparativo!A28)","v":""},{"$f":"IF('Lista de Produtos'!D19=\"\",\"\",'Lista de Produtos'!D19)","v":""},{"$f":"IF(Comparativo!C28=\"\",\"\",Comparativo!C28)","v":""},"",{"$f":"IF('Lista de Produtos'!E19=\"\",\"\",'Lista de Produtos'!E19)","v":""}]
[{"$f":"IF(Comparativo!A29=\"\",\"\",Comparativo!A29)","v":""},{"$f":"IF('Lista de Produtos'!D20=\"\",\"\",'Lista de Produtos'!D20)","v":""},{"$f":"IF(Comparativo!C29=\"\",\"\",Comparativo!C29)","v":""},"",{"$f":"IF('Lista de Produtos'!E20=\"\",\"\",'Lista de Produtos'!E20)","v":""}]
[{"$f":"IF(Comparativo!A30=\"\",\"\",Comparativo!A30)","v":""},{"$f":"IF('Lista de Produtos'!D21=\"\",\"\",'Lista de Produtos'!D21)","v":""},{"$f":"IF(Comparativo!C30=\"\",\"\",Comparativo!C30)","v":""},"",{"$f":"IF('Lista de Produtos'!E21=\"\",\"\",'Lista de Produtos'!E21)","v":""}]
[{"$f":"IF(Comparativo!A31=\"\",\"\",Comparativo!A31)","v":""},{"$f":"IF('Lista de Produtos'!D22=\"\",\"\",'Lista de Produtos'!D22)","v":""},{"$f":"IF(Comparativo!C31=\"\",\"\",Comparativo!C31)","v":""},"",{"$f":"IF('Lista de Produtos'!E22=\"\",\"\",'Lista de Produtos'!E22)","v":""}]
[{"$f":"IF(Comparativo!A32=\"\",\"\",Comparativo!A32)","v":""},{"$f":"IF('Lista de Produtos'!D23=\"\",\"\",'Lista de Produtos'!D23)","v":""},{"$f":"IF(Comparativo!C32=\"\",\"\",Comparativo!C32)","v":""},"",{"$f":"IF('Lista de Produtos'!E23=\"\",\"\",'Lista de Produtos'!E23)","v":""}]
[{"$f":"IF(Comparativo!A33=\"\",\"\",Comparativo!A33)","v":""},{"$f":"IF('Lista de Produtos'!D24=\"\",\"\",'Lista de Produtos'!D24)","v":""},{"$f":"IF(Comparativo!C33=\"\",\"\",Comparativo!C33)","v":""},"",{"$f":"IF('Lista de Produtos'!E24=\"\",\"\",'Lista de Produtos'!E24)","v":""}]
[{"$f":"IF(Comparativo!A34=\"\",\"\",Comparativo!A34)","v":""},{"$f":"IF('Lista de Produtos'!D25=\"\",\"\",'Lista de Produtos'!D25)","v":""},{"$f":"IF(Comparativo!C34=\"\",\"\",Comparativo!C34)","v":""},"",{"$f":"IF('Lista de Produtos'!E25=\"\",\"\",'Lista de Produtos'!E25)","v":""}]
[{"$f":"IF(Comparativo!A35=\"\",\"\",Comparativo!A35)","v":""},{"$f":"IF('Lista de Produtos'!D26=\"\",\"\",'Lista de Produtos'!D26)","v":""},{"$f":"IF(Comparativo!C35=\"\",\"\",Comparativo!C35)","v":""},"",{"$f":"IF('Lista de Produtos'!E26=\"\",\"\",'Lista de Produtos'!E26)","v":""}]
[{"$f":"IF(Comparativo!A36=\"\",\"\",Comparativo!A36)","v":""},{"$f":"IF('Lista de Produtos'!D27=\"\",\"\",'Lista de Produtos'!D27)","v":""},{"$f":"IF(Comparativo!C36=\"\",\"\",Comparativo!C36)","v":""},"",{"$f":"IF('Lista de Produtos'!E27=\"\",\"\",'Lista de Produtos'!E27)","v":""}]
[{"$f":"IF(Comparativo!A37=\"\",\"\",Comparativo!A37)","v":""},{"$f":"IF('Lista de Produtos'!D28=\"\",\"\",'Lista de Produtos'!D28)","v":""},{"$f":"IF(Comparativo!C37=\"\",\"\",Comparativo!C37)","v":""},"",{"$f":"IF('Lista de Produtos'!E28=\"\",\"\",'Lista de Produtos'!E28)","v":""}]
[{"$f":"IF(Comparativo!A38=\"\",\"\",Comparativo!A38)","v":""},{"$f":"IF('Lista de Produtos'!D29=\"\",\"\",'Lista de Produtos'!D29)","v":""},{"$f":"IF(Comparativo!C38=\"\",\"\",Comparativo!C38)","v":""},"",{"$f":"IF('Lista de Produtos'!E29=\"\",\"\",'Lista de Produtos'!E29)","v":""}]
[{"$f":"IF(Comparativo!A39=\"\",\"\",Comparativo!A39)","v":""},{"$f":"IF('Lista de Produtos'!D30=\"\",\"\",'Lista de Produtos'!D30)","v":""},{"$f":"IF(Comparativo!C39=\"\",\"\",Comparativo!C39)","v":""},"",{"$f":"IF('Lista de Produtos'!E30=\"\",\"\",'Lista de Produtos'!E30)","v":""}]
[{"$f":"IF(Comparativo!A40=\"\",\"\",Comparativo!A40)","v":""},{"$f":"IF('Lista de Produtos'!D31=\"\",\"\",'Lista de Produtos'!D31)","v":""},{"$f":"IF(Comparativo!C40=\"\",\"\",Comparativo!C40)","v":""},"",{"$f":"IF('Lista de Produtos'!E31=\"\",\"\",'Lista de Produtos'!E31)","v":""}]
[{"$f":"IF(Comparativo!A41=\"\",\"\",Comparativo!A41)","v":""},{"$f":"IF('Lista de Produtos'!D32=\"\",\"\",'Lista de Produtos'!D32)","v":""},{"$f":"IF(Comparativo!C41=\"\",\"\",Comparativo!C41)","v":""},"",{"$f":"IF('Lista de Produtos'!E32=\"\",\"\",'Lista de Produtos'!E32)","v":""}]