{"text_format":"1","workbook":"xlsx","n_sheets":3,"sheets":["Início","Tabela de Preços","Gerar Orçamento"],"not_rendered":{"charts":0,"images":3,"macros":1,"external_links":0,"defined_names":1,"comments":1,"pivot_tables":0},"unopened":[],"bounds":{"document_bytes":16777216,"sheet_cells":100000,"rows_first":2000,"rows_last":500,"rows_between":2000,"halvings":0,"cell_chars":16384,"cell_head_chars":4096},"cells_cut":0,"cells_raw":0,"read":"whole","date_system":"1900"}

{"sheet":"Início","index":0,"n_rows":10,"n_cols":13,"rows_kept":10,"cut":false,"hidden":false,"merged":[[1,1,1,9],[9,6,9,8],[4,6,4,8],[6,6,6,8],[5,6,5,8],[7,6,7,8],[8,6,8,8],[6,4,6,5],[7,4,7,5],[8,4,8,5],[9,4,9,5]]}
[]
[null,"Planilha Simplificada para Orçamentos e Pedidos"]
[]
[null,null,null,null,null,null,null,null,null,null,null,null,"Desenvolvido por:"]
[null,null,null,null,null,null,"Dados da empresa"]
[]
[null,null,null,null,"Razão Social",null,"empresax"]
[null,null,null,null,"CNPJ",null,1111]
[null,null,null,null,"Telefone",null,"19-888"]
[null,null,null,null,"Endereço",null,"Rua x"]

{"sheet":"Tabela de Preços","index":1,"n_rows":12,"n_cols":3,"rows_kept":12,"cut":false,"hidden":false,"merged":[]}
[null,"TABELA DE PREÇOS"]
[]
["Código","Produto","Preço Unitário"]
[123,"Processador I5",400]
[1234,"GAVETA EXT. 2,5\" SATA GV GVT050",67]
[5656,"HUB 4 PORTAS USB FORTREK 51922 HBU401",34]
[7454,"PASTA TERMICA PRATA IMPLASTEC C/5G LYS 9012",34]
[678,"PELICULA IPAD2 CRISTAL FORTREK 48887 ISP102",24]
[454,"ADAPTADOR DE SOM USB 7.1 GV COV020",63]
[2368,"ANTENA ZIROK 45CM WLL 455 5.8GHZ",6]
[3336,"LEITOR COD. BARRA CCD PS2 ELGIN BS313 PTO",3]
[5534,"CABO \"Y\" VGA DB15M / 2 DB15F CBV020 GV",6]

{"sheet":"Gerar Orçamento","index":2,"n_rows":200,"n_cols":7,"rows_kept":200,"cut":false,"hidden":false,"merged":[[13,1,13,3],[14,1,14,3],[15,1,15,3],[16,1,16,3],[182,1,182,3],[183,1,183,3],[184,1,184,3],[185,1,185,3],[186,1,186,3],[177,1,177,3],[178,1,178,3],[179,1,179,3],[180,1,180,3],[197,1,197,3],[198,1,198,3],[199,1,199,3],[192,1,192,3],[193,1,193,3],[194,1,194,3],[195,1,195,3],[196,1,196,3],[187,1,187,3],[188,1,188,3],[189,1,189,3],[190,1,190,3],[191,1,191,3],[181,1,181,3],[172,1,172,3],[173,1,173,3],[174,1,174,3],[175,1,175,3],[176,1,176,3],[167,1,167,3],[168,1,168,3],[169,1,169,3],[170,1,170,3],[171,1,171,3],[162,1,162,3],[163,1,163,3],[164,1,164,3],[165,1,165,3],[166,1,166,3],[157,1,157,3],[158,1,158,3],[159,1,159,3],[160,1,160,3],[161,1,161,3],[152,1,152,3],[153,1,153,3],[154,1,154,3],[155,1,155,3],[156,1,156,3],[147,1,147,3],[148,1,148,3],[149,1,149,3],[150,1,150,3],[151,1,151,3],[142,1,142,3],[143,1,143,3],[144,1,144,3],[145,1,145,3],[146,1,146,3],[137,1,137,3],[138,1,138,3],[139,1,139,3],[140,1,140,3],[141,1,141,3],[132,1,132,3],[133,1,133,3],[134,1,134,3],[135,1,135,3],[136,1,136,3],[127,1,127,3],[128,1,128,3],[129,1,129,3],[130,1,130,3],[131,1,131,3],[122,1,122,3],[123,1,123,3],[124,1,124,3],[125,1,125,3],[126,1,126,3],[117,1,117,3],[118,1,118,3],[119,1,119,3],[120,1,120,3],[121,1,121,3],[112,1,112,3],[113,1,113,3],[114,1,114,3],[115,1,115,3],[116,1,116,3],[107,1,107,3],[108,1,108,3],[109,1,109,3],[110,1,110,3],[111,1,111,3],[102,1,102,3],[103,1,103,3],[104,1,104,3],[105,1,105,3],[106,1,106,3],[97,1,97,3],[98,1,98,3],[99,1,99,3],[100,1,100,3],[101,1,101,3],[92,1,92,3],[93,1,93,3],[94,1,94,3],[95,1,95,3],[96,1,96,3],[87,1,87,3],[88,1,88,3],[89,1,89,3],[90,1,90,3],[91,1,91,3],[82,1,82,3],[83,1,83,3],[84,1,84,3],[85,1,85,3],[86,1,86,3],[77,1,77,3],[78,1,78,3],[79,1,79,3],[80,1,80,3],[81,1,81,3],[72,1,72,3],[73,1,73,3],[74,1,74,3],[75,1,75,3],[76,1,76,3],[67,1,67,3],[68,1,68,3],[69,1,69,3],[70,1,70,3],[71,1,71,3],[62,1,62,3],[63,1,63,3],[64,1,64,3],[65,1,65,3],[66,1,66,3],[57,1,57,3],[58,1,58,3],[59,1,59,3],[60,1,60,3],[61,1,61,3],[52,1,52,3],[53,1,53,3],[54,1,54,3],[55,1,55,3],[56,1,56,3],[47,1,47,3],[48,1,48,3],[49,1,49,3],[50,1,50,3],[51,1,51,3],[42,1,42,3],[43,1,43,3],[44,1,44,3],[45,1,45,3],[46,1,46,3],[37,1,37,3],[38,1,38,3],[39,1,39,3],[40,1,40,3],[41,1,41,3],[32,1,32,3],[33,1,33,3],[34,1,34,3],[35,1,35,3],[36,1,36,3],[27,1,27,3],[28,1,28,3],[29,1,29,3],[30,1,30,3],[31,1,31,3],[22,1,22,3],[23,1,23,3],[24,1,24,3],[25,1,25,3],[26,1,26,3],[19,1,19,3],[20,1,20,3],[21,1,21,3],[0,0,6,1],[5,2,6,2],[0,3,0,6],[1,3,1,6],[7,2,7,6],[3,3,3,4],[2,3,2,4],[4,3,4,4],[5,3,6,4],[17,1,17,3],[18,1,18,3],[8,1,8,3],[9,1,9,3],[10,1,10,3],[11,1,11,3],[12,1,12,3]]}
["Insira aqui a sua Logo",null,"Razão Social",{"$f":"Início!G7","v":"empresax"}]
[null,null,"CNPJ",{"$f":"Início!G8","v":1111}]
[null,null,"Endereço",{"$f":"Início!G10","v":"Rua x"},null,"Telefone",{"$f":"Início!G9","v":"19-888"}]
[null,null,"Cliente",null,null,"Válido até:"]
[null,null,"Telefone",null,null,"Desconto (%)"]
[null,null,"Orçamento no",null,null,"Total",{"$f":"SUM(G10:G200)","v":0}]
[null,null,null,null,null,"Total c/ desconto",{"$f":"G6-((G6*G5)/100)","v":0}]
[]
["Código","Produto",null,null,"Preço Unitário","Quantidade","Total"]
[null,{"$f":"IFERROR(VLOOKUP(A10,'Tabela de Preços'!$A$4:$C$2004,2,0),\"-\")","v":"-"},null,null,{"$f":"IFERROR(VLOOKUP(A10,'Tabela de Preços'!$A$4:$C$2004,3,0),\"-\")","v":"-"},null,{"$f":"IFERROR((E10*F10),\"-\")","v":"-"}]
[null,{"$f":"IFERROR(VLOOKUP(A11,'Tabela de Preços'!$A$4:$C$2004,2,0),\"-\")","v":"-"},null,null,{"$f":"IFERROR(VLOOKUP(A11,'Tabela de Preços'!$A$4:$C$2004,3,0),\"-\")","v":"-"},null,{"$f":"IFERROR((E11*F11),\"-\")","v":"-"}]
[null,{"$f":"IFERROR(VLOOKUP(A12,'Tabela de Preços'!$A$4:$C$2004,2,0),\"-\")","v":"-"},null,null,{"$f":"IFERROR(VLOOKUP(A12,'Tabela de Preços'!$A$4:$C$2004,3,0),\"-\")","v":"-"},null,"-"]
[null,{"$f":"IFERROR(VLOOKUP(A13,'Tabela de Preços'!$A$4:$C$2004,2,0),\"-\")","v":"-"},null,null,{"$f":"IFERROR(VLOOKUP(A13,'Tabela de Preços'!$A$4:$C$2004,3,0),\"-\")","v":"-"},null,"-"]
[null,{"$f":"IFERROR(VLOOKUP(A14,'Tabela de Preços'!$A$4:$C$2004,2,0),\"-\")","v":"-"},null,null,{"$f":"IFERROR(VLOOKUP(A14,'Tabela de Preços'!$A$4:$C$2004,3,0),\"-\")","v":"-"},null,"-"]
[null,{"$f":"IFERROR(VLOOKUP(A15,'Tabela de Preços'!$A$4:$C$2004,2,0),\"-\")","v":"-"},null,null,{"$f":"IFERROR(VLOOKUP(A15,'Tabela de Preços'!$A$4:$C$2004,3,0),\"-\")","v":"-"},null,"-"]
[null,{"$f":"IFERROR(VLOOKUP(A16,'Tabela de Preços'!$A$4:$C$2004,2,0),\"-\")","v":"-"},null,null,{"$f":"IFERROR(VLOOKUP(A16,'Tabela de Preços'!$A$4:$C$2004,3,0),\"-\")","v":"-"},null,"-"]
[null,{"$f":"IFERROR(VLOOKUP(A17,'Tabela de Preços'!$A$4:$C$2004,2,0),\"-\")","v":"-"},null,null,{"$f":"IFERROR(VLOOKUP(A17,'Tabela de Preços'!$A$4:$C$2004,3,0),\"-\")","v":"-"},null,"-"]
[null,{"$f":"IFERROR(VLOOKUP(A18,'Tabela de Preços'!$A$4:$C$2004,2,0),\"-\")","v":"-"},null,null,{"$f":"IFERROR(VLOOKUP(A18,'Tabela de Preços'!$A$4:$C$2004,3,0),\"-\")","v":"-"},null,"-"]
[null,{"$f":"IFERROR(VLOOKUP(A19,'Tabela de Preços'!$A$4:$C$2004,2,0),\"-\")","v":"-"},null,null,{"$f":"IFERROR(VLOOKUP(A19,'Tabela de Preços'!$A$4:$C$2004,3,0),\"-\")","v":"-"},null,"-"]
[null,{"$f":"IFERROR(VLOOKUP(A20,'Tabela de Preços'!$A$4:$C$2004,2,0),\"-\")","v":"-"},null,null,{"$f":"IFERROR(VLOOKUP(A20,'Tabela de Preços'!$A$4:$C$2004,3,0),\"-\")","v":"-"},null,"-"]
[null,{"$f":"IFERROR(VLOOKUP(A21,'Tabela de Preços'!$A$4:$C$2004,2,0),\"-\")","v":"-"},null,null,{"$f":"IFERROR(VLOOKUP(A21,'Tabela de Preços'!$A$4:$C$2004,3,0),\"-\")","v":"-"},null,"-"]
[null,{"$f":"IFERROR(VLOOKUP(A22,'Tabela de Preços'!$A$4:$C$2004,2,0),\"-\")","v":"-"},null,null,{"$f":"IFERROR(VLOOKUP(A22,'Tabela de Preços'!$A$4:$C$2004,3,0),\"-\")","v":"-"},null,"-"]
[null,{"$f":"IFERROR(VLOOKUP(A23,'Tabela de Preços'!$A$4:$C$2004,2,0),\"-\")","v":"-"},null,null,{"$f":"IFERROR(VLOOKUP(A23,'Tabela de Preços'!$A$4:$C$2004,3,0),\"-\")","v":"-"},null,"-"]
[null,{"$f":"IFERROR(VLOOKUP(A24,'Tabela de Preços'!$A$4:$C$2004,2,0),\"-\")","v":"-"},null,null,{"$f":"IFERROR(VLOOKUP(A24,'Tabela de Preços'!$A$4:$C$2004,3,0),\"-\")","v":"-"},null,"-"]
[null,{"$f":"IFERROR(VLOOKUP(A25,'Tabela de Preços'!$A$4:$C$2004,2,0),\"-\")","v":"-"},null,null,{"$f":"IFERROR(VLOOKUP(A25,'Tabela de Preços'!$A$4:$C$2004,3,0),\"-\")","v":"-"},null,"-"]
[null,{"$f":"IFERROR(VLOOKUP(A26,'Tabela de Preços'!$A$4:$C$2004,2,0),\"-\")","v":"-"},null,null,{"$f":"IFERROR(VLOOKUP(A26,'Tabela de Preços'!$A$4:$C$2004,3,0),\"-\")","v":"-"},null,"-"]
[null,{"$f":"IFERROR(VLOOKUP(A27,'Tabela de Preços'!$A$4:$C$2004,2,0),\"-\")","v":"-"},null,null,{"$f":"IFERROR(VLOOKUP(A27,'Tabela de Preços'!$A$4:$C$2004,3,0),\"-\")","v":"-"},null,"-"]
[null,{"$f":"IFERROR(VLOOKUP(A28,'Tabela de Preços'!$A$4:$C$2004,2,0),\"-\")","v":"-"},null,null,{"$f":"IFERROR(VLOOKUP(A28,'Tabela de Preços'!$A$4:$C$2004,3,0),\"-\")","v":"-"},null,"-"]
[null,{"$f":"IFERROR(VLOOKUP(A29,'Tabela de Preços'!$A$4:$C$2004,2,0),\"-\")","v":"-"},null,null,{"$f":"IFERROR(VLOOKUP(A29,'Tabela de Preços'!$A$4:$C$2004,3,0),\"-\")","v":"-"},null,"-"]
[null,{"$f":"IFERROR(VLOOKUP(A30,'Tabela de Preços'!$A$4:$C$2004,2,0),\"-\")","v":"-"},null,null,{"$f":"IFERROR(VLOOKUP(A30,'Tabela de Preços'!$A$4:$C$2004,3,0),\"-\")","v":"-"},null,"-"]
[null,{"$f":"IFERROR(VLOOKUP(A31,'Tabela de Preços'!$A$4:$C$2004,2,0),\"-\")","v":"-"},null,null,{"$f":"IFERROR(VLOOKUP(A31,'Tabela de Preços'!$A$4:$C$2004,3,0),\"-\")","v":"-"},null,"-"]
[null,{"$f":"IFERROR(VLOOKUP(A32,'Tabela de Preços'!$A$4:$C$2004,2,0),\"-\")","v":"-"},null,null,{"$f":"IFERROR(VLOOKUP(A32,'Tabela de Preços'!$A$4:$C$2004,3,0),\"-\")","v":"-"},null,"-"]
[null,{"$f":"IFERROR(VLOOKUP(A33,'Tabela de Preços'!$A$4:$C$2004,2,0),\"-\")","v":"-"},null,null,{"$f":"IFERROR(VLOOKUP(A33,'Tabela de Preços'!$A$4:$C$2004,3,0),\"-\")","v":"-"},null,"-"]
[null,{"$f":"IFERROR(VLOOKUP(A34,'Tabela de Preços'!$A$4:$C$2004,2,0),\"-\")","v":"-"},null,null,{"$f":"IFERROR(VLOOKUP(A34,'Tabela de Preços'!$A$4:$C$2004,3,0),\"-\")","v":"-"},null,"-"]
[null,{"$f":"IFERROR(VLOOKUP(A35,'Tabela de Preços'!$A$4:$C$2004,2,0),\"-\")","v":"-"},null,null,{"$f":"IFERROR(VLOOKUP(A35,'Tabela de Preços'!$A$4:$C$2004,3,0),\"-\")","v":"-"},null,"-"]
[null,{"$f":"IFERROR(VLOOKUP(A36,'Tabela de Preços'!$A$4:$C$2004,2,0),\"-\")","v":"-"},null,null,{"$f":"IFERROR(VLOOKUP(A36,'Tabela de Preços'!$A$4:$C$2004,3,0),\"-\")","v":"-"},null,"-"]
[null,{"$f":"IFERROR(VLOOKUP(A37,'Tabela de Preços'!$A$4:$C$2004,2,0),\"-\")","v":"-"},null,null,{"$f":"IFERROR(VLOOKUP(A37,'Tabela de Preços'!$A$4:$C$2004,3,0),\"-\")","v":"-"},null,"-"]
[null,{"$f":"IFERROR(VLOOKUP(A38,'Tabela de Preços'!$A$4:$C$2004,2,0),\"-\")","v":"-"},null,null,{"$f":"IFERROR(VLOOKUP(A38,'Tabela de Preços'!$A$4:$C$2004,3,0),\"-\")","v":"-"},null,"-"]
[null,{"$f":"IFERROR(VLOOKUP(A39,'Tabela de Preços'!$A$4:$C$2004,2,0),\"-\")","v":"-"},null,null,{"$f":"IFERROR(VLOOKUP(A39,'Tabela de Preços'!$A$4:$C$2004,3,0),\"-\")","v":"-"},null,"-"]
[null,{"$f":"IFERROR(VLOOKUP(A40,'Tabela de Preços'!$A$4:$C$2004,2,0),\"-\")","v":"-"},null,null,{"$f":"IFERROR(VLOOKUP(A40,'Tabela de Preços'!$A$4:$C$2004,3,0),\"-\")","v":"-"},null,"-"]
[null,{"$f":"IFERROR(VLOOKUP(A41,'Tabela de Preços'!$A$4:$C$2004,2,0),\"-\")","v":"-"},null,null,{"$f":"IFERROR(VLOOKUP(A41,'Tabela de Preços'!$A$4:$C$2004,3,0),\"-\")","v":"-"},null,"-"]
[null,{"$f":"IFERROR(VLOOKUP(A42,'Tabela de Preços'!$A$4:$C$2004,2,0),\"-\")","v":"-"},null,null,{"$f":"IFERROR(VLOOKUP(A42,'Tabela de Preços'!$A$4:$C$2004,3,0),\"-\")","v":"-"},null,"-"]
[null,{"$f":"IFERROR(VLOOKUP(A43,'Tabela de Preços'!$A$4:$C$2004,2,0),\"-\")","v":"-"},null,null,{"$f":"IFERROR(VLOOKUP(A43,'Tabela de Preços'!$A$4:$C$2004,3,0),\"-\")","v":"-"},null,"-"]
[null,{"$f":"IFERROR(VLOOKUP(A44,'Tabela de Preços'!$A$4:$C$2004,2,0),\"-\")","v":"-"},null,null,{"$f":"IFERROR(VLOOKUP(A44,'Tabela de Preços'!$A$4:$C$2004,3,0),\"-\")","v":"-"},null,"-"]
[null,{"$f":"IFERROR(VLOOKUP(A45,'Tabela de Preços'!$A$4:$C$2004,2,0),\"-\")","v":"-"},null,null,{"$f":"IFERROR(VLOOKUP(A45,'Tabela de Preços'!$A$4:$C$2004,3,0),\"-\")","v":"-"},null,"-"]
[null,{"$f":"IFERROR(VLOOKUP(A46,'Tabela de Preços'!$A$4:$C$2004,2,0),\"-\")","v":"-"},null,null,{"$f":"IFERROR(VLOOKUP(A46,'Tabela de Preços'!$A$4:$C$2004,3,0),\"-\")","v":"-"},null,"-"]
[null,{"$f":"IFERROR(VLOOKUP(A47,'Tabela de Preços'!$A$4:$C$2004,2,0),\"-\")","v":"-"},null,null,{"$f":"IFERROR(VLOOKUP(A47,'Tabela de Preços'!$A$4:$C$2004,3,0),\"-\")","v":"-"},null,"-"]
[null,{"$f":"IFERROR(VLOOKUP(A48,'Tabela de Preços'!$A$4:$C$2004,2,0),\"-\")","v":"-"},null,null,{"$f":"IFERROR(VLOOKUP(A48,'Tabela de Preços'!$A$4:$C$2004,3,0),\"-\")","v":"-"},null,"-"]
[null,{"$f":"IFERROR(VLOOKUP(A49,'Tabela de Preços'!$A$4:$C$2004,2,0),\"-\")","v":"-"},null,null,{"$f":"IFERROR(VLOOKUP(A49,'Tabela de Preços'!$A$4:$C$2004,3,0),\"-\")","v":"-"},null,"-"]
[null,{"$f":"IFERROR(VLOOKUP(A50,'Tabela de Preços'!$A$4:$C$2004,2,0),\"-\")","v":"-"},null,null,{"$f":"IFERROR(VLOOKUP(A50,'Tabela de Preços'!$A$4:$C$2004,3,0),\"-\")","v":"-"},null,"-"]
[null,{"$f":"IFERROR(VLOOKUP(A51,'Tabela de Preços'!$A$4:$C$2004,2,0),\"-\")","v":"-"},null,null,{"$f":"IFERROR(VLOOKUP(A51,'Tabela de Preços'!$A$4:$C$2004,3,0),\"-\")","v":"-"},null,"-"]
[null,{"$f":"IFERROR(VLOOKUP(A52,'Tabela de Preços'!$A$4:$C$2004,2,0),\"-\")","v":"-"},null,null,{"$f":"IFERROR(VLOOKUP(A52,'Tabela de Preços'!$A$4:$C$2004,3,0),\"-\")","v":"-"},null,"-"]
[null,{"$f":"IFERROR(VLOOKUP(A53,'Tabela de Preços'!$A$4:$C$2004,2,0),\"-\")","v":"-"},null,null,{"$f":"IFERROR(VLOOKUP(A53,'Tabela de Preços'!$A$4:$C$2004,3,0),\"-\")","v":"-"},null,"-"]
[null,{"$f":"IFERROR(VLOOKUP(A54,'Tabela de Preços'!$A$4:$C$2004,2,0),\"-\")","v":"-"},null,null,{"$f":"IFERROR(VLOOKUP(A54,'Tabela de Preços'!$A$4:$C$2004,3,0),\"-\")","v":"-"},null,"-"]
[null,{"$f":"IFERROR(VLOOKUP(A55,'Tabela de Preços'!$A$4:$C$2004,2,0),\"-\")","v":"-"},null,null,{"$f":"IFERROR(VLOOKUP(A55,'Tabela de Preços'!$A$4:$C$2004,3,0),\"-\")","v":"-"},null,"-"]
[null,{"$f":"IFERROR(VLOOKUP(A56,'Tabela de Preços'!$A$4:$C$2004,2,0),\"-\")","v":"-"},null,null,{"$f":"IFERROR(VLOOKUP(A56,'Tabela de Preços'!$A$4:$C$2004,3,0),\"-\")","v":"-"},null,"-"]
[null,{"$f":"IFERROR(VLOOKUP(A57,'Tabela de Preços'!$A$4:$C$2004,2,0),\"-\")","v":"-"},null,null,{"$f":"IFERROR(VLOOKUP(A57,'Tabela de Preços'!$A$4:$C$2004,3,0),\"-\")","v":"-"},null,"-"]
[null,{"$f":"IFERROR(VLOOKUP(A58,'Tabela de Preços'!$A$4:$C$2004,2,0),\"-\")","v":"-"},null,null,{"$f":"IFERROR(VLOOKUP(A58,'Tabela de Preços'!$A$4:$C$2004,3,0),\"-\")","v":"-"},null,"-"]
[null,{"$f":"IFERROR(VLOOKUP(A59,'Tabela de Preços'!$A$4:$C$2004,2,0),\"-\")","v":"-"},null,null,{"$f":"IFERROR(VLOOKUP(A59,'Tabela de Preços'!$A$4:$C$2004,3,0),\"-\")","v":"-"},null,"-"]
[null,{"$f":"IFERROR(VLOOKUP(A60,'Tabela de Preços'!$A$4:$C$2004,2,0),\"-\")","v":"-"},null,null,{"$f":"IFERROR(VLOOKUP(A60,'Tabela de Preços'!$A$4:$C$2004,3,0),\"-\")","v":"-"},null,"-"]
[null,{"$f":"IFERROR(VLOOKUP(A61,'Tabela de Preços'!$A$4:$C$2004,2,0),\"-\")","v":"-"},null,null,{"$f":"IFERROR(VLOOKUP(A61,'Tabela de Preços'!$A$4:$C$2004,3,0),\"-\")","v":"-"},null,"-"]
[null,{"$f":"IFERROR(VLOOKUP(A62,'Tabela de Preços'!$A$4:$C$2004,2,0),\"-\")","v":"-"},null,null,{"$f":"IFERROR(VLOOKUP(A62,'Tabela de Preços'!$A$4:$C$2004,3,0),\"-\")","v":"-"},null,"-"]
[null,{"$f":"IFERROR(VLOOKUP(A63,'Tabela de Preços'!$A$4:$C$2004,2,0),\"-\")","v":"-"},null,null,{"$f":"IFERROR(VLOOKUP(A63,'Tabela de Preços'!$A$4:$C$2004,3,0),\"-\")","v":"-"},null,"-"]
[null,{"$f":"IFERROR(VLOOKUP(A64,'Tabela de Preços'!$A$4:$C$2004,2,0),\"-\")","v":"-"},null,null,{"$f":"IFERROR(VLOOKUP(A64,'Tabela de Preços'!$A$4:$C$2004,3,0),\"-\")","v":"-"},null,"-"]
[null,{"$f":"IFERROR(VLOOKUP(A65,'Tabela de Preços'!$A$4:$C$2004,2,0),\"-\")","v":"-"},null,null,{"$f":"IFERROR(VLOOKUP(A65,'Tabela de Preços'!$A$4:$C$2004,3,0),\"-\")","v":"-"},null,"-"]
[null,{"$f":"IFERROR(VLOOKUP(A66,'Tabela de Preços'!$A$4:$C$2004,2,0),\"-\")","v":"-"},null,null,{"$f":"IFERROR(VLOOKUP(A66,'Tabela de Preços'!$A$4:$C$2004,3,0),\"-\")","v":"-"},null,"-"]
[null,{"$f":"IFERROR(VLOOKUP(A67,'Tabela de Preços'!$A$4:$C$2004,2,0),\"-\")","v":"-"},null,null,{"$f":"IFERROR(VLOOKUP(A67,'Tabela de Preços'!$A$4:$C$2004,3,0),\"-\")","v":"-"},null,"-"]
[null,{"$f":"IFERROR(VLOOKUP(A68,'Tabela de Preços'!$A$4:$C$2004,2,0),\"-\")","v":"-"},null,null,{"$f":"IFERROR(VLOOKUP(A68,'Tabela de Preços'!$A$4:$C$2004,3,0),\"-\")","v":"-"},null,"-"]
[null,{"$f":"IFERROR(VLOOKUP(A69,'Tabela de Preços'!$A$4:$C$2004,2,0),\"-\")","v":"-"},null,null,{"$f":"IFERROR(VLOOKUP(A69,'Tabela de Preços'!$A$4:$C$2004,3,0),\"-\")","v":"-"},null,"-"]
[null,{"$f":"IFERROR(VLOOKUP(A70,'Tabela de Preços'!$A$4:$C$2004,2,0),\"-\")","v":"-"},null,null,{"$f":"IFERROR(VLOOKUP(A70,'Tabela de Preços'!$A$4:$C$2004,3,0),\"-\")","v":"-"},null,"-"]
[null,{"$f":"IFERROR(VLOOKUP(A71,'Tabela de Preços'!$A$4:$C$2004,2,0),\"-\")","v":"-"},null,null,{"$f":"IFERROR(VLOOKUP(A71,'Tabela de Preços'!$A$4:$C$2004,3,0),\"-\")","v":"-"},null,"-"]
[null,{"$f":"IFERROR(VLOOKUP(A72,'Tabela de Preços'!$A$4:$C$2004,2,0),\"-\")","v":"-"},null,null,{"$f":"IFERROR(VLOOKUP(A72,'Tabela de Preços'!$A$4:$C$2004,3,0),\"-\")","v":"-"},null,"-"]
[null,{"$f":"IFERROR(VLOOKUP(A73,'Tabela de Preços'!$A$4:$C$2004,2,0),\"-\")","v":"-"},null,null,{"$f":"IFERROR(VLOOKUP(A73,'Tabela de Preços'!$A$4:$C$2004,3,0),\"-\")","v":"-"},null,"-"]
[null,{"$f":"IFERROR(VLOOKUP(A74,'Tabela de Preços'!$A$4:$C$2004,2,0),\"-\")","v":"-"},null,null,{"$f":"IFERROR(VLOOKUP(A74,'Tabela de Preços'!$A$4:$C$2004,3,0),\"-\")","v":"-"},null,"-"]
[null,{"$f":"IFERROR(VLOOKUP(A75,'Tabela de Preços'!$A$4:$C$2004,2,0),\"-\")","v":"-"},null,null,{"$f":"IFERROR(VLOOKUP(A75,'Tabela de Preços'!$A$4:$C$2004,3,0),\"-\")","v":"-"},null,{"$f":"IFERROR((E75*F75),\"-\")","v":"-"}]
[null,{"$f":"IFERROR(VLOOKUP(A76,'Tabela de Preços'!$A$4:$C$2004,2,0),\"-\")","v":"-"},null,null,{"$f":"IFERROR(VLOOKUP(A76,'Tabela de Preços'!$A$4:$C$2004,3,0),\"-\")","v":"-"},null,"-"]
[null,{"$f":"IFERROR(VLOOKUP(A77,'Tabela de Preços'!$A$4:$C$2004,2,0),\"-\")","v":"-"},null,null,{"$f":"IFERROR(VLOOKUP(A77,'Tabela de Preços'!$A$4:$C$2004,3,0),\"-\")","v":"-"},null,"-"]
[null,{"$f":"IFERROR(VLOOKUP(A78,'Tabela de Preços'!$A$4:$C$2004,2,0),\"-\")","v":"-"},null,null,{"$f":"IFERROR(VLOOKUP(A78,'Tabela de Preços'!$A$4:$C$2004,3,0),\"-\")","v":"-"},null,"-"]
[null,{"$f":"IFERROR(VLOOKUP(A79,'Tabela de Preços'!$A$4:$C$2004,2,0),\"-\")","v":"-"},null,null,{"$f":"IFERROR(VLOOKUP(A79,'Tabela de Preços'!$A$4:$C$2004,3,0),\"-\")","v":"-"},null,"-"]
[null,{"$f":"IFERROR(VLOOKUP(A80,'Tabela de Preços'!$A$4:$C$2004,2,0),\"-\")","v":"-"},null,null,{"$f":"IFERROR(VLOOKUP(A80,'Tabela de Preços'!$A$4:$C$2004,3,0),\"-\")","v":"-"},null,"-"]
[null,{"$f":"IFERROR(VLOOKUP(A81,'Tabela de Preços'!$A$4:$C$2004,2,0),\"-\")","v":"-"},null,null,{"$f":"IFERROR(VLOOKUP(A81,'Tabela de Preços'!$A$4:$C$2004,3,0),\"-\")","v":"-"},null,"-"]
[null,{"$f":"IFERROR(VLOOKUP(A82,'Tabela de Preços'!$A$4:$C$2004,2,0),\"-\")","v":"-"},null,null,{"$f":"IFERROR(VLOOKUP(A82,'Tabela de Preços'!$A$4:$C$2004,3,0),\"-\")","v":"-"},null,"-"]
[null,{"$f":"IFERROR(VLOOKUP(A83,'Tabela de Preços'!$A$4:$C$2004,2,0),\"-\")","v":"-"},null,null,{"$f":"IFERROR(VLOOKUP(A83,'Tabela de Preços'!$A$4:$C$2004,3,0),\"-\")","v":"-"},null,"-"]
[null,{"$f":"IFERROR(VLOOKUP(A84,'Tabela de Preços'!$A$4:$C$2004,2,0),\"-\")","v":"-"},null,null,{"$f":"IFERROR(VLOOKUP(A84,'Tabela de Preços'!$A$4:$C$2004,3,0),\"-\")","v":"-"},null,"-"]
[null,{"$f":"IFERROR(VLOOKUP(A85,'Tabela de Preços'!$A$4:$C$2004,2,0),\"-\")","v":"-"},null,null,{"$f":"IFERROR(VLOOKUP(A85,'Tabela de Preços'!$A$4:$C$2004,3,0),\"-\")","v":"-"},null,"-"]
[null,{"$f":"IFERROR(VLOOKUP(A86,'Tabela de Preços'!$A$4:$C$2004,2,0),\"-\")","v":"-"},null,null,{"$f":"IFERROR(VLOOKUP(A86,'Tabela de Preços'!$A$4:$C$2004,3,0),\"-\")","v":"-"},null,"-"]
[null,{"$f":"IFERROR(VLOOKUP(A87,'Tabela de Preços'!$A$4:$C$2004,2,0),\"-\")","v":"-"},null,null,{"$f":"IFERROR(VLOOKUP(A87,'Tabela de Preços'!$A$4:$C$2004,3,0),\"-\")","v":"-"},null,"-"]
[null,{"$f":"IFERROR(VLOOKUP(A88,'Tabela de Preços'!$A$4:$C$2004,2,0),\"-\")","v":"-"},null,null,{"$f":"IFERROR(VLOOKUP(A88,'Tabela de Preços'!$A$4:$C$2004,3,0),\"-\")","v":"-"},null,"-"]
[null,{"$f":"IFERROR(VLOOKUP(A89,'Tabela de Preços'!$A$4:$C$2004,2,0),\"-\")","v":"-"},null,null,{"$f":"IFERROR(VLOOKUP(A89,'Tabela de Preços'!$A$4:$C$2004,3,0),\"-\")","v":"-"},null,"-"]
[null,{"$f":"IFERROR(VLOOKUP(A90,'Tabela de Preços'!$A$4:$C$2004,2,0),\"-\")","v":"-"},null,null,{"$f":"IFERROR(VLOOKUP(A90,'Tabela de Preços'!$A$4:$C$2004,3,0),\"-\")","v":"-"},null,"-"]
[null,{"$f":"IFERROR(VLOOKUP(A91,'Tabela de Preços'!$A$4:$C$2004,2,0),\"-\")","v":"-"},null,null,{"$f":"IFERROR(VLOOKUP(A91,'Tabela de Preços'!$A$4:$C$2004,3,0),\"-\")","v":"-"},null,"-"]
[null,{"$f":"IFERROR(VLOOKUP(A92,'Tabela de Preços'!$A$4:$C$2004,2,0),\"-\")","v":"-"},null,null,{"$f":"IFERROR(VLOOKUP(A92,'Tabela de Preços'!$A$4:$C$2004,3,0),\"-\")","v":"-"},null,"-"]
[null,{"$f":"IFERROR(VLOOKUP(A93,'Tabela de Preços'!$A$4:$C$2004,2,0),\"-\")","v":"-"},null,null,{"$f":"IFERROR(VLOOKUP(A93,'Tabela de Preços'!$A$4:$C$2004,3,0),\"-\")","v":"-"},null,"-"]
[null,{"$f":"IFERROR(VLOOKUP(A94,'Tabela de Preços'!$A$4:$C$2004,2,0),\"-\")","v":"-"},null,null,{"$f":"IFERROR(VLOOKUP(A94,'Tabela de Preços'!$A$4:$C$2004,3,0),\"-\")","v":"-"},null,"-"]
[null,{"$f":"IFERROR(VLOOKUP(A95,'Tabela de Preços'!$A$4:$C$2004,2,0),\"-\")","v":"-"},null,null,{"$f":"IFERROR(VLOOKUP(A95,'Tabela de Preços'!$A$4:$C$2004,3,0),\"-\")","v":"-"},null,"-"]
[null,{"$f":"IFERROR(VLOOKUP(A96,'Tabela de Preços'!$A$4:$C$2004,2,0),\"-\")","v":"-"},null,null,{"$f":"IFERROR(VLOOKUP(A96,'Tabela de Preços'!$A$4:$C$2004,3,0),\"-\")","v":"-"},null,"-"]
[null,{"$f":"IFERROR(VLOOKUP(A97,'Tabela de Preços'!$A$4:$C$2004,2,0),\"-\")","v":"-"},null,null,{"$f":"IFERROR(VLOOKUP(A97,'Tabela de Preços'!$A$4:$C$2004,3,0),\"-\")","v":"-"},null,"-"]
[null,{"$f":"IFERROR(VLOOKUP(A98,'Tabela de Preços'!$A$4:$C$2004,2,0),\"-\")","v":"-"},null,null,{"$f":"IFERROR(VLOOKUP(A98,'Tabela de Preços'!$A$4:$C$2004,3,0),\"-\")","v":"-"},null,"-"]
[null,{"$f":"IFERROR(VLOOKUP(A99,'Tabela de Preços'!$A$4:$C$2004,2,0),\"-\")","v":"-"},null,null,{"$f":"IFERROR(VLOOKUP(A99,'Tabela de Preços'!$A$4:$C$2004,3,0),\"-\")","v":"-"},null,"-"]
[null,{"$f":"IFERROR(VLOOKUP(A100,'Tabela de Preços'!$A$4:$C$2004,2,0),\"-\")","v":"-"},null,null,{"$f":"IFERROR(VLOOKUP(A100,'Tabela de Preços'!$A$4:$C$2004,3,0),\"-\")","v":"-"},null,"-"]
[null,{"$f":"IFERROR(VLOOKUP(A101,'Tabela de Preços'!$A$4:$C$2004,2,0),\"-\")","v":"-"},null,null,{"$f":"IFERROR(VLOOKUP(A101,'Tabela de Preços'!$A$4:$C$2004,3,0),\"-\")","v":"-"},null,"-"]
[null,{"$f":"IFERROR(VLOOKUP(A102,'Tabela de Preços'!$A$4:$C$2004,2,0),\"-\")","v":"-"},null,null,{"$f":"IFERROR(VLOOKUP(A102,'Tabela de Preços'!$A$4:$C$2004,3,0),\"-\")","v":"-"},null,"-"]
[null,{"$f":"IFERROR(VLOOKUP(A103,'Tabela de Preços'!$A$4:$C$2004,2,0),\"-\")","v":"-"},null,null,{"$f":"IFERROR(VLOOKUP(A103,'Tabela de Preços'!$A$4:$C$2004,3,0),\"-\")","v":"-"},null,"-"]
[null,{"$f":"IFERROR(VLOOKUP(A104,'Tabela de Preços'!$A$4:$C$2004,2,0),\"-\")","v":"-"},null,null,{"$f":"IFERROR(VLOOKUP(A104,'Tabela de Preços'!$A$4:$C$2004,3,0),\"-\")","v":"-"},null,"-"]
[null,{"$f":"IFERROR(VLOOKUP(A105,'Tabela de Preços'!$A$4:$C$2004,2,0),\"-\")","v":"-"},null,null,{"$f":"IFERROR(VLOOKUP(A105,'Tabela de Preços'!$A$4:$C$2004,3,0),\"-\")","v":"-"},null,"-"]
[null,{"$f":"IFERROR(VLOOKUP(A106,'Tabela de Preços'!$A$4:$C$2004,2,0),\"-\")","v":"-"},null,null,{"$f":"IFERROR(VLOOKUP(A106,'Tabela de Preços'!$A$4:$C$2004,3,0),\"-\")","v":"-"},null,"-"]
[null,{"$f":"IFERROR(VLOOKUP(A107,'Tabela de Preços'!$A$4:$C$2004,2,0),\"-\")","v":"-"},null,null,{"$f":"IFERROR(VLOOKUP(A107,'Tabela de Preços'!$A$4:$C$2004,3,0),\"-\")","v":"-"},null,"-"]
[null,{"$f":"IFERROR(VLOOKUP(A108,'Tabela de Preços'!$A$4:$C$2004,2,0),\"-\")","v":"-"},null,null,{"$f":"IFERROR(VLOOKUP(A108,'Tabela de Preços'!$A$4:$C$2004,3,0),\"-\")","v":"-"},null,"-"]
[null,{"$f":"IFERROR(VLOOKUP(A109,'Tabela de Preços'!$A$4:$C$2004,2,0),\"-\")","v":"-"},null,null,{"$f":"IFERROR(VLOOKUP(A109,'Tabela de Preços'!$A$4:$C$2004,3,0),\"-\")","v":"-"},null,"-"]
[null,{"$f":"IFERROR(VLOOKUP(A110,'Tabela de Preços'!$A$4:$C$2004,2,0),\"-\")","v":"-"},null,null,{"$f":"IFERROR(VLOOKUP(A110,'Tabela de Preços'!$A$4:$C$2004,3,0),\"-\")","v":"-"},null,"-"]
[null,{"$f":"IFERROR(VLOOKUP(A111,'Tabela de Preços'!$A$4:$C$2004,2,0),\"-\")","v":"-"},null,null,{"$f":"IFERROR(VLOOKUP(A111,'Tabela de Preços'!$A$4:$C$2004,3,0),\"-\")","v":"-"},null,"-"]
[null,{"$f":"IFERROR(VLOOKUP(A112,'Tabela de Preços'!$A$4:$C$2004,2,0),\"-\")","v":"-"},null,null,{"$f":"IFERROR(VLOOKUP(A112,'Tabela de Preços'!$A$4:$C$2004,3,0),\"-\")","v":"-"},null,"-"]
[null,{"$f":"IFERROR(VLOOKUP(A113,'Tabela de Preços'!$A$4:$C$2004,2,0),\"-\")","v":"-"},null,null,{"$f":"IFERROR(VLOOKUP(A113,'Tabela de Preços'!$A$4:$C$2004,3,0),\"-\")","v":"-"},null,"-"]
[null,{"$f":"IFERROR(VLOOKUP(A114,'Tabela de Preços'!$A$4:$C$2004,2,0),\"-\")","v":"-"},null,null,{"$f":"IFERROR(VLOOKUP(A114,'Tabela de Preços'!$A$4:$C$2004,3,0),\"-\")","v":"-"},null,"-"]
[null,{"$f":"IFERROR(VLOOKUP(A115,'Tabela de Preços'!$A$4:$C$2004,2,0),\"-\")","v":"-"},null,null,{"$f":"IFERROR(VLOOKUP(A115,'Tabela de Preços'!$A$4:$C$2004,3,0),\"-\")","v":"-"},null,"-"]
[null,{"$f":"IFERROR(VLOOKUP(A116,'Tabela de Preços'!$A$4:$C$2004,2,0),\"-\")","v":"-"},null,null,{"$f":"IFERROR(VLOOKUP(A116,'Tabela de Preços'!$A$4:$C$2004,3,0),\"-\")","v":"-"},null,"-"]
[null,{"$f":"IFERROR(VLOOKUP(A117,'Tabela de Preços'!$A$4:$C$2004,2,0),\"-\")","v":"-"},null,null,{"$f":"IFERROR(VLOOKUP(A117,'Tabela de Preços'!$A$4:$C$2004,3,0),\"-\")","v":"-"},null,"-"]
[null,{"$f":"IFERROR(VLOOKUP(A118,'Tabela de Preços'!$A$4:$C$2004,2,0),\"-\")","v":"-"},null,null,{"$f":"IFERROR(VLOOKUP(A118,'Tabela de Preços'!$A$4:$C$2004,3,0),\"-\")","v":"-"},null,"-"]
[null,{"$f":"IFERROR(VLOOKUP(A119,'Tabela de Preços'!$A$4:$C$2004,2,0),\"-\")","v":"-"},null,null,{"$f":"IFERROR(VLOOKUP(A119,'Tabela de Preços'!$A$4:$C$2004,3,0),\"-\")","v":"-"},null,"-"]
[null,{"$f":"IFERROR(VLOOKUP(A120,'Tabela de Preços'!$A$4:$C$2004,2,0),\"-\")","v":"-"},null,null,{"$f":"IFERROR(VLOOKUP(A120,'Tabela de Preços'!$A$4:$C$2004,3,0),\"-\")","v":"-"},null,"-"]
{"$rows_left_out":80}