{"text_format":"1","workbook":"xlsx","n_sheets":6,"sheets":["Início","Instruções","Cadastro","Funcionários","Registro de Horas","Folha de Ponto"],"not_rendered":{"charts":0,"images":3,"macros":1,"external_links":0,"defined_names":5,"comments":0,"pivot_tables":0},"unopened":[],"bounds":{"document_bytes":16777216,"sheet_cells":100000,"rows_first":2000,"rows_last":500,"rows_between":2000,"halvings":0,"cell_chars":16384,"cell_head_chars":4096},"cells_cut":0,"cells_raw":0,"read":"whole","date_system":"1900"}

{"sheet":"Início","index":0,"n_rows":2,"n_cols":2,"rows_kept":2,"cut":false,"hidden":false,"merged":[[1,1,1,3],[2,1,2,3]]}
[]
[null,"Controle de Horas / Folha de Ponto"]

{"sheet":"Instruções","index":1,"n_rows":51,"n_cols":1,"rows_kept":51,"cut":false,"hidden":false,"merged":[[50,0,53,14],[0,0,0,14],[4,0,4,14],[6,0,9,14],[2,0,2,14],[16,0,22,14],[24,0,24,14],[11,0,13,14],[25,0,33,14],[35,0,35,14],[36,0,43,14],[15,0,15,14],[45,0,48,14]]}
["INSTRUÇÕES DE USO (LEIA ANTES DE USAR PLANILHA)"]
[]
["ATENÇÃO!"]
["Antes de utilizar a planilha, é necessário habilitar as macros. Para isto, siga as etapas apresentadas neste vídeo:"]
["https://youtu.be/nOrhtwX-Oac"]
[]
["A planilha é compatível apenas com o Microsoft Excel 2010 para Windows e versões superiores.\nA planilha não é compatível com Excel Online, Google Planilhas, Excel para celular, Excel para tablet ou qualquer outro software de planilha que não seja o Microsoft Excel 2010 para Windows e versões superiores."]
[]
[]
[]
[]
["A Planilha Controle de Horas e Folha de Ponto não realiza cálculos de salários nem diferencia horas extras de horas normais para plantonistas."]
[]
[]
[]
["Passo 1: Cadastro de Funcionários"]
["1. Acesse a guia \"Cadastro\" ou clique no botão \"Cadastrar funcionários\" no menu inicial.\n2. Preencha os campo: Matrícula, Nome, Departamento, Função, Carga Horária Diária e Data de admissão.\n* Todos os campos são de preenchimento obrigatório.\n3. Clique no botão \"Salvar cadastro\" para enviar os dados do funcionário para a guia \"Funcionários.\n4. Se precisar editar um cadastro, clique no botão \"Editar cadastro\" ou acesse a guia \"Funcionários\"."]
[]
[]
[]
[]
[]
[]
[]
["Passo 2: Registro de Horas trabalhadas"]
["1. Acesse a guia \"Registro de Horas\" ou clique no botão \"Registro de Horas\" no menu inicial.\n2. Selecione a matrícula do funcionário na lista. A planilha mostrará automaticamente o funcionário na coluna B e a carga horária diária do funcionário na coluna I.\n3. Insira a data em que deseja registrar as horas trabalhadas (Formato DD/MM/AAAA).\n4. Insira a Hora de Entrada, Horário de Saída p/ Intervalo, Horário de retorno do Intervalo e Horário de Saída. Todos os horários devem estar no formato HH:MM.\n\n*Após preencher os campos acima, a planilha mostrará as Horas Trabalhadas na coluna H e o saldo do Dia na coluna J.\n*Não deixe linhas em branco entre os registros de horas, pois isto poderá gerar erros na planilha."]
[]
[]
[]
[]
[]
[]
[]
[]
[]
["Passo 3: Gerando a folha de ponto"]
["1. Acesse a guia \"Folha de Ponto\" ou clique no botão \"Gerar Folha de Ponto\" no menu inicial.\n2. Selecione a matrícula do funcionário na célula C3. Os dados do funcionário serão mostrados automaticamente no cabeçalho da folha de ponto.\n3. Preencha os campos \"Data Inicial\" e \"Data Final\" com as datas em que deseja gerar a folha de ponto. Para gerar a folha de ponto do mês de janeiro, por exemplo, basta inserir 01/01/2024 no campo \"Data Inicial\" e 31/01/2024 no campo de \"Data final\".\n4. Após preencher os campos Matrícula, Data inicial e Data final, clique no botão \"Gerar Folha de Ponto\". A planilha mostrará todos os registros de horas trabalhadas do funcionário selecionando, dentro do período escolhido.\n5. Para imprimir a folha de ponto, clique no botão \"Imprimir Folha de Ponto\"."]
[]
[]
[]
[]
[]
[]
[]
[]
["A Planilha é bloqueada para edição em sua estrutura por questões de direitos autorais. Não fornecemos senhas da planilha.\nImportante: Não realizamos alterações na planilha."]
[]
[]
[]
[]
["A Planilha é disponibilizada exclusivamente no site oficial do desenvolvedor. O download de modelo não lhe garante o direito de comercializá-lo ou distribuí-lo em outros sites. Qualquer violação de direitos autorais será respondida judicialmente."]

{"sheet":"Cadastro","index":2,"n_rows":16,"n_cols":5,"rows_kept":16,"cut":false,"hidden":false,"merged":[]}
[]
[]
[]
[null,null,null,null,"Cadastrar Funcionários"]
[]
[null,null,null,"Matrícula"]
[]
[null,null,null,"Nome"]
[]
[null,null,null,"Departamento"]
[]
[null,null,null,"Função"]
[]
[null,null,null,"Carga Horária Diária"]
[]
[null,null,null,"Data de admissão"]

{"sheet":"Funcionários","index":3,"n_rows":1,"n_cols":6,"rows_kept":1,"cut":false,"hidden":false,"merged":[]}
["Matrícula","Nome","Departamento","Função","Carga Horária Diária","Data de Admissão"]

{"sheet":"Registro de Horas","index":4,"n_rows":2001,"n_cols":10,"rows_kept":2001,"cut":false,"hidden":false,"merged":[]}
["Matrícula","Nome","Data","Horário de Entrada","Horário de Saída p/ Intervalo","Horário de retorno do Intervalo","Horário de Saída","Horas Trabalhadas","Carga Horária / Diaria","Saldo do Dia"]
[null,{"$f":"IFERROR(IF(A2=\"\",\"\",VLOOKUP(A2,Funcionários!$A$2:$F$299,2,0)),\"Funcionário não encontrado\")","v":""},null,null,null,null,null,{"$f":"IF(OR(D2=\"\",E2=\"\",F2=\"\"),\"\",MOD((E2-D2)+(G2-F2),1))","v":""},{"$f":"IFERROR(IF(A2=\"\",\"\",VLOOKUP(A2,Funcionários!$A$2:$F$299,5,0)),\"\")","v":""},{"$f":"IF(H2=\"\",\"\",H2-I2)","v":""}]
[null,{"$f":"IFERROR(IF(A3=\"\",\"\",VLOOKUP(A3,Funcionários!$A$2:$F$299,2,0)),\"Funcionário não encontrado\")","v":""},null,null,null,null,null,{"$f":"IF(OR(D3=\"\",E3=\"\",F3=\"\"),\"\",MOD((E3-D3)+(G3-F3),1))","v":""},{"$f":"IFERROR(IF(A3=\"\",\"\",VLOOKUP(A3,Funcionários!$A$2:$F$299,5,0)),\"\")","v":""},{"$f":"IF(H3=\"\",\"\",H3-I3)","v":""}]
[null,{"$f":"IFERROR(IF(A4=\"\",\"\",VLOOKUP(A4,Funcionários!$A$2:$F$299,2,0)),\"Funcionário não encontrado\")","v":""},null,null,null,null,null,"",{"$f":"IFERROR(IF(A4=\"\",\"\",VLOOKUP(A4,Funcionários!$A$2:$F$299,5,0)),\"\")","v":""},""]
[null,{"$f":"IFERROR(IF(A5=\"\",\"\",VLOOKUP(A5,Funcionários!$A$2:$F$299,2,0)),\"Funcionário não encontrado\")","v":""},null,null,null,null,null,"",{"$f":"IFERROR(IF(A5=\"\",\"\",VLOOKUP(A5,Funcionários!$A$2:$F$299,5,0)),\"\")","v":""},""]
[null,{"$f":"IFERROR(IF(A6=\"\",\"\",VLOOKUP(A6,Funcionários!$A$2:$F$299,2,0)),\"Funcionário não encontrado\")","v":""},null,null,null,null,null,"",{"$f":"IFERROR(IF(A6=\"\",\"\",VLOOKUP(A6,Funcionários!$A$2:$F$299,5,0)),\"\")","v":""},""]
[null,{"$f":"IFERROR(IF(A7=\"\",\"\",VLOOKUP(A7,Funcionários!$A$2:$F$299,2,0)),\"Funcionário não encontrado\")","v":""},null,null,null,null,null,"",{"$f":"IFERROR(IF(A7=\"\",\"\",VLOOKUP(A7,Funcionários!$A$2:$F$299,5,0)),\"\")","v":""},""]
[null,{"$f":"IFERROR(IF(A8=\"\",\"\",VLOOKUP(A8,Funcionários!$A$2:$F$299,2,0)),\"Funcionário não encontrado\")","v":""},null,null,null,null,null,"",{"$f":"IFERROR(IF(A8=\"\",\"\",VLOOKUP(A8,Funcionários!$A$2:$F$299,5,0)),\"\")","v":""},""]
[null,{"$f":"IFERROR(IF(A9=\"\",\"\",VLOOKUP(A9,Funcionários!$A$2:$F$299,2,0)),\"Funcionário não encontrado\")","v":""},null,null,null,null,null,"",{"$f":"IFERROR(IF(A9=\"\",\"\",VLOOKUP(A9,Funcionários!$A$2:$F$299,5,0)),\"\")","v":""},""]
[null,{"$f":"IFERROR(IF(A10=\"\",\"\",VLOOKUP(A10,Funcionários!$A$2:$F$299,2,0)),\"Funcionário não encontrado\")","v":""},null,null,null,null,null,"",{"$f":"IFERROR(IF(A10=\"\",\"\",VLOOKUP(A10,Funcionários!$A$2:$F$299,5,0)),\"\")","v":""},""]
[null,{"$f":"IFERROR(IF(A11=\"\",\"\",VLOOKUP(A11,Funcionários!$A$2:$F$299,2,0)),\"Funcionário não encontrado\")","v":""},null,null,null,null,null,"",{"$f":"IFERROR(IF(A11=\"\",\"\",VLOOKUP(A11,Funcionários!$A$2:$F$299,5,0)),\"\")","v":""},""]
[null,{"$f":"IFERROR(IF(A12=\"\",\"\",VLOOKUP(A12,Funcionários!$A$2:$F$299,2,0)),\"Funcionário não encontrado\")","v":""},null,null,null,null,null,"",{"$f":"IFERROR(IF(A12=\"\",\"\",VLOOKUP(A12,Funcionários!$A$2:$F$299,5,0)),\"\")","v":""},""]
[null,{"$f":"IFERROR(IF(A13=\"\",\"\",VLOOKUP(A13,Funcionários!$A$2:$F$299,2,0)),\"Funcionário não encontrado\")","v":""},null,null,null,null,null,"",{"$f":"IFERROR(IF(A13=\"\",\"\",VLOOKUP(A13,Funcionários!$A$2:$F$299,5,0)),\"\")","v":""},""]
[null,{"$f":"IFERROR(IF(A14=\"\",\"\",VLOOKUP(A14,Funcionários!$A$2:$F$299,2,0)),\"Funcionário não encontrado\")","v":""},null,null,null,null,null,"",{"$f":"IFERROR(IF(A14=\"\",\"\",VLOOKUP(A14,Funcionários!$A$2:$F$299,5,0)),\"\")","v":""},""]
[null,{"$f":"IFERROR(IF(A15=\"\",\"\",VLOOKUP(A15,Funcionários!$A$2:$F$299,2,0)),\"Funcionário não encontrado\")","v":""},null,null,null,null,null,"",{"$f":"IFERROR(IF(A15=\"\",\"\",VLOOKUP(A15,Funcionários!$A$2:$F$299,5,0)),\"\")","v":""},""]
[null,{"$f":"IFERROR(IF(A16=\"\",\"\",VLOOKUP(A16,Funcionários!$A$2:$F$299,2,0)),\"Funcionário não encontrado\")","v":""},null,null,null,null,null,"",{"$f":"IFERROR(IF(A16=\"\",\"\",VLOOKUP(A16,Funcionários!$A$2:$F$299,5,0)),\"\")","v":""},""]
[null,{"$f":"IFERROR(IF(A17=\"\",\"\",VLOOKUP(A17,Funcionários!$A$2:$F$299,2,0)),\"Funcionário não encontrado\")","v":""},null,null,null,null,null,"",{"$f":"IFERROR(IF(A17=\"\",\"\",VLOOKUP(A17,Funcionários!$A$2:$F$299,5,0)),\"\")","v":""},""]
[null,{"$f":"IFERROR(IF(A18=\"\",\"\",VLOOKUP(A18,Funcionários!$A$2:$F$299,2,0)),\"Funcionário não encontrado\")","v":""},null,null,null,null,null,"",{"$f":"IFERROR(IF(A18=\"\",\"\",VLOOKUP(A18,Funcionários!$A$2:$F$299,5,0)),\"\")","v":""},""]
[null,{"$f":"IFERROR(IF(A19=\"\",\"\",VLOOKUP(A19,Funcionários!$A$2:$F$299,2,0)),\"Funcionário não encontrado\")","v":""},null,null,null,null,null,"",{"$f":"IFERROR(IF(A19=\"\",\"\",VLOOKUP(A19,Funcionários!$A$2:$F$299,5,0)),\"\")","v":""},""]
[null,{"$f":"IFERROR(IF(A20=\"\",\"\",VLOOKUP(A20,Funcionários!$A$2:$F$299,2,0)),\"Funcionário não encontrado\")","v":""},null,null,null,null,null,"",{"$f":"IFERROR(IF(A20=\"\",\"\",VLOOKUP(A20,Funcionários!$A$2:$F$299,5,0)),\"\")","v":""},""]
[null,{"$f":"IFERROR(IF(A21=\"\",\"\",VLOOKUP(A21,Funcionários!$A$2:$F$299,2,0)),\"Funcionário não encontrado\")","v":""},null,null,null,null,null,"",{"$f":"IFERROR(IF(A21=\"\",\"\",VLOOKUP(A21,Funcionários!$A$2:$F$299,5,0)),\"\")","v":""},""]
[null,{"$f":"IFERROR(IF(A22=\"\",\"\",VLOOKUP(A22,Funcionários!$A$2:$F$299,2,0)),\"Funcionário não encontrado\")","v":""},null,null,null,null,null,"",{"$f":"IFERROR(IF(A22=\"\",\"\",VLOOKUP(A22,Funcionários!$A$2:$F$299,5,0)),\"\")","v":""},""]
[null,{"$f":"IFERROR(IF(A23=\"\",\"\",VLOOKUP(A23,Funcionários!$A$2:$F$299,2,0)),\"Funcionário não encontrado\")","v":""},null,null,null,null,null,"",{"$f":"IFERROR(IF(A23=\"\",\"\",VLOOKUP(A23,Funcionários!$A$2:$F$299,5,0)),\"\")","v":""},""]
[null,{"$f":"IFERROR(IF(A24=\"\",\"\",VLOOKUP(A24,Funcionários!$A$2:$F$299,2,0)),\"Funcionário não encontrado\")","v":""},null,null,null,null,null,"",{"$f":"IFERROR(IF(A24=\"\",\"\",VLOOKUP(A24,Funcionários!$A$2:$F$299,5,0)),\"\")","v":""},""]
[null,{"$f":"IFERROR(IF(A25=\"\",\"\",VLOOKUP(A25,Funcionários!$A$2:$F$299,2,0)),\"Funcionário não encontrado\")","v":""},null,null,null,null,null,"",{"$f":"IFERROR(IF(A25=\"\",\"\",VLOOKUP(A25,Funcionários!$A$2:$F$299,5,0)),\"\")","v":""},""]
[null,{"$f":"IFERROR(IF(A26=\"\",\"\",VLOOKUP(A26,Funcionários!$A$2:$F$299,2,0)),\"Funcionário não encontrado\")","v":""},null,null,null,null,null,"",{"$f":"IFERROR(IF(A26=\"\",\"\",VLOOKUP(A26,Funcionários!$A$2:$F$299,5,0)),\"\")","v":""},""]
[null,{"$f":"IFERROR(IF(A27=\"\",\"\",VLOOKUP(A27,Funcionários!$A$2:$F$299,2,0)),\"Funcionário não encontrado\")","v":""},null,null,null,null,null,"",{"$f":"IFERROR(IF(A27=\"\",\"\",VLOOKUP(A27,Funcionários!$A$2:$F$299,5,0)),\"\")","v":""},""]
[null,{"$f":"IFERROR(IF(A28=\"\",\"\",VLOOKUP(A28,Funcionários!$A$2:$F$299,2,0)),\"Funcionário não encontrado\")","v":""},null,null,null,null,null,"",{"$f":"IFERROR(IF(A28=\"\",\"\",VLOOKUP(A28,Funcionários!$A$2:$F$299,5,0)),\"\")","v":""},""]
[null,{"$f":"IFERROR(IF(A29=\"\",\"\",VLOOKUP(A29,Funcionários!$A$2:$F$299,2,0)),\"Funcionário não encontrado\")","v":""},null,null,null,null,null,"",{"$f":"IFERROR(IF(A29=\"\",\"\",VLOOKUP(A29,Funcionários!$A$2:$F$299,5,0)),\"\")","v":""},""]
[null,{"$f":"IFERROR(IF(A30=\"\",\"\",VLOOKUP(A30,Funcionários!$A$2:$F$299,2,0)),\"Funcionário não encontrado\")","v":""},null,null,null,null,null,"",{"$f":"IFERROR(IF(A30=\"\",\"\",VLOOKUP(A30,Funcionários!$A$2:$F$299,5,0)),\"\")","v":""},""]
[null,{"$f":"IFERROR(IF(A31=\"\",\"\",VLOOKUP(A31,Funcionários!$A$2:$F$299,2,0)),\"Funcionário não encontrado\")","v":""},null,null,null,null,null,"",{"$f":"IFERROR(IF(A31=\"\",\"\",VLOOKUP(A31,Funcionários!$A$2:$F$299,5,0)),\"\")","v":""},""]
[null,{"$f":"IFERROR(IF(A32=\"\",\"\",VLOOKUP(A32,Funcionários!$A$2:$F$299,2,0)),\"Funcionário não encontrado\")","v":""},null,null,null,null,null,"",{"$f":"IFERROR(IF(A32=\"\",\"\",VLOOKUP(A32,Funcionários!$A$2:$F$299,5,0)),\"\")","v":""},""]
[null,{"$f":"IFERROR(IF(A33=\"\",\"\",VLOOKUP(A33,Funcionários!$A$2:$F$299,2,0)),\"Funcionário não encontrado\")","v":""},null,null,null,null,null,"",{"$f":"IFERROR(IF(A33=\"\",\"\",VLOOKUP(A33,Funcionários!$A$2:$F$299,5,0)),\"\")","v":""},""]
[null,{"$f":"IFERROR(IF(A34=\"\",\"\",VLOOKUP(A34,Funcionários!$A$2:$F$299,2,0)),\"Funcionário não encontrado\")","v":""},null,null,null,null,null,"",{"$f":"IFERROR(IF(A34=\"\",\"\",VLOOKUP(A34,Funcionários!$A$2:$F$299,5,0)),\"\")","v":""},""]
[null,{"$f":"IFERROR(IF(A35=\"\",\"\",VLOOKUP(A35,Funcionários!$A$2:$F$299,2,0)),\"Funcionário não encontrado\")","v":""},null,null,null,null,null,"",{"$f":"IFERROR(IF(A35=\"\",\"\",VLOOKUP(A35,Funcionários!$A$2:$F$299,5,0)),\"\")","v":""},""]
[null,{"$f":"IFERROR(IF(A36=\"\",\"\",VLOOKUP(A36,Funcionários!$A$2:$F$299,2,0)),\"Funcionário não encontrado\")","v":""},null,null,null,null,null,"",{"$f":"IFERROR(IF(A36=\"\",\"\",VLOOKUP(A36,Funcionários!$A$2:$F$299,5,0)),\"\")","v":""},""]
[null,{"$f":"IFERROR(IF(A37=\"\",\"\",VLOOKUP(A37,Funcionários!$A$2:$F$299,2,0)),\"Funcionário não encontrado\")","v":""},null,null,null,null,null,"",{"$f":"IFERROR(IF(A37=\"\",\"\",VLOOKUP(A37,Funcionários!$A$2:$F$299,5,0)),\"\")","v":""},""]
[null,{"$f":"IFERROR(IF(A38=\"\",\"\",VLOOKUP(A38,Funcionários!$A$2:$F$299,2,0)),\"Funcionário não encontrado\")","v":""},null,null,null,null,null,"",{"$f":"IFERROR(IF(A38=\"\",\"\",VLOOKUP(A38,Funcionários!$A$2:$F$299,5,0)),\"\")","v":""},""]
[null,{"$f":"IFERROR(IF(A39=\"\",\"\",VLOOKUP(A39,Funcionários!$A$2:$F$299,2,0)),\"Funcionário não encontrado\")","v":""},null,null,null,null,null,"",{"$f":"IFERROR(IF(A39=\"\",\"\",VLOOKUP(A39,Funcionários!$A$2:$F$299,5,0)),\"\")","v":""},""]
[null,{"$f":"IFERROR(IF(A40=\"\",\"\",VLOOKUP(A40,Funcionários!$A$2:$F$299,2,0)),\"Funcionário não encontrado\")","v":""},null,null,null,null,null,"",{"$f":"IFERROR(IF(A40=\"\",\"\",VLOOKUP(A40,Funcionários!$A$2:$F$299,5,0)),\"\")","v":""},""]
[null,{"$f":"IFERROR(IF(A41=\"\",\"\",VLOOKUP(A41,Funcionários!$A$2:$F$299,2,0)),\"Funcionário não encontrado\")","v":""},null,null,null,null,null,"",{"$f":"IFERROR(IF(A41=\"\",\"\",VLOOKUP(A41,Funcionários!$A$2:$F$299,5,0)),\"\")","v":""},""]
[null,{"$f":"IFERROR(IF(A42=\"\",\"\",VLOOKUP(A42,Funcionários!$A$2:$F$299,2,0)),\"Funcionário não encontrado\")","v":""},null,null,null,null,null,"",{"$f":"IFERROR(IF(A42=\"\",\"\",VLOOKUP(A42,Funcionários!$A$2:$F$299,5,0)),\"\")","v":""},""]
[null,{"$f":"IFERROR(IF(A43=\"\",\"\",VLOOKUP(A43,Funcionários!$A$2:$F$299,2,0)),\"Funcionário não encontrado\")","v":""},null,null,null,null,null,"",{"$f":"IFERROR(IF(A43=\"\",\"\",VLOOKUP(A43,Funcionários!$A$2:$F$299,5,0)),\"\")","v":""},""]
[null,{"$f":"IFERROR(IF(A44=\"\",\"\",VLOOKUP(A44,Funcionários!$A$2:$F$299,2,0)),\"Funcionário não encontrado\")","v":""},null,null,null,null,null,"",{"$f":"IFERROR(IF(A44=\"\",\"\",VLOOKUP(A44,Funcionários!$A$2:$F$299,5,0)),\"\")","v":""},""]
[null,{"$f":"IFERROR(IF(A45=\"\",\"\",VLOOKUP(A45,Funcionários!$A$2:$F$299,2,0)),\"Funcionário não encontrado\")","v":""},null,null,null,null,null,"",{"$f":"IFERROR(IF(A45=\"\",\"\",VLOOKUP(A45,Funcionários!$A$2:$F$299,5,0)),\"\")","v":""},""]
[null,{"$f":"IFERROR(IF(A46=\"\",\"\",VLOOKUP(A46,Funcionários!$A$2:$F$299,2,0)),\"Funcionário não encontrado\")","v":""},null,null,null,null,null,"",{"$f":"IFERROR(IF(A46=\"\",\"\",VLOOKUP(A46,Funcionários!$A$2:$F$299,5,0)),\"\")","v":""},""]
[null,{"$f":"IFERROR(IF(A47=\"\",\"\",VLOOKUP(A47,Funcionários!$A$2:$F$299,2,0)),\"Funcionário não encontrado\")","v":""},null,null,null,null,null,"",{"$f":"IFERROR(IF(A47=\"\",\"\",VLOOKUP(A47,Funcionários!$A$2:$F$299,5,0)),\"\")","v":""},""]
[null,{"$f":"IFERROR(IF(A48=\"\",\"\",VLOOKUP(A48,Funcionários!$A$2:$F$299,2,0)),\"Funcionário não encontrado\")","v":""},null,null,null,null,null,"",{"$f":"IFERROR(IF(A48=\"\",\"\",VLOOKUP(A48,Funcionários!$A$2:$F$299,5,0)),\"\")","v":""},""]
[null,{"$f":"IFERROR(IF(A49=\"\",\"\",VLOOKUP(A49,Funcionários!$A$2:$F$299,2,0)),\"Funcionário não encontrado\")","v":""},null,null,null,null,null,"",{"$f":"IFERROR(IF(A49=\"\",\"\",VLOOKUP(A49,Funcionários!$A$2:$F$299,5,0)),\"\")","v":""},""]
[null,{"$f":"IFERROR(IF(A50=\"\",\"\",VLOOKUP(A50,Funcionários!$A$2:$F$299,2,0)),\"Funcionário não encontrado\")","v":""},null,null,null,null,null,"",{"$f":"IFERROR(IF(A50=\"\",\"\",VLOOKUP(A50,Funcionários!$A$2:$F$299,5,0)),\"\")","v":""},""]
[null,{"$f":"IFERROR(IF(A51=\"\",\"\",VLOOKUP(A51,Funcionários!$A$2:$F$299,2,0)),\"Funcionário não encontrado\")","v":""},null,null,null,null,null,"",{"$f":"IFERROR(IF(A51=\"\",\"\",VLOOKUP(A51,Funcionários!$A$2:$F$299,5,0)),\"\")","v":""},""]
[null,{"$f":"IFERROR(IF(A52=\"\",\"\",VLOOKUP(A52,Funcionários!$A$2:$F$299,2,0)),\"Funcionário não encontrado\")","v":""},null,null,null,null,null,"",{"$f":"IFERROR(IF(A52=\"\",\"\",VLOOKUP(A52,Funcionários!$A$2:$F$299,5,0)),\"\")","v":""},""]
[null,{"$f":"IFERROR(IF(A53=\"\",\"\",VLOOKUP(A53,Funcionários!$A$2:$F$299,2,0)),\"Funcionário não encontrado\")","v":""},null,null,null,null,null,"",{"$f":"IFERROR(IF(A53=\"\",\"\",VLOOKUP(A53,Funcionários!$A$2:$F$299,5,0)),\"\")","v":""},""]
[null,{"$f":"IFERROR(IF(A54=\"\",\"\",VLOOKUP(A54,Funcionários!$A$2:$F$299,2,0)),\"Funcionário não encontrado\")","v":""},null,null,null,null,null,"",{"$f":"IFERROR(IF(A54=\"\",\"\",VLOOKUP(A54,Funcionários!$A$2:$F$299,5,0)),\"\")","v":""},""]
[null,{"$f":"IFERROR(IF(A55=\"\",\"\",VLOOKUP(A55,Funcionários!$A$2:$F$299,2,0)),\"Funcionário não encontrado\")","v":""},null,null,null,null,null,"",{"$f":"IFERROR(IF(A55=\"\",\"\",VLOOKUP(A55,Funcionários!$A$2:$F$299,5,0)),\"\")","v":""},""]
[null,{"$f":"IFERROR(IF(A56=\"\",\"\",VLOOKUP(A56,Funcionários!$A$2:$F$299,2,0)),\"Funcionário não encontrado\")","v":""},null,null,null,null,null,"",{"$f":"IFERROR(IF(A56=\"\",\"\",VLOOKUP(A56,Funcionários!$A$2:$F$299,5,0)),\"\")","v":""},""]
[null,{"$f":"IFERROR(IF(A57=\"\",\"\",VLOOKUP(A57,Funcionários!$A$2:$F$299,2,0)),\"Funcionário não encontrado\")","v":""},null,null,null,null,null,"",{"$f":"IFERROR(IF(A57=\"\",\"\",VLOOKUP(A57,Funcionários!$A$2:$F$299,5,0)),\"\")","v":""},""]
[null,{"$f":"IFERROR(IF(A58=\"\",\"\",VLOOKUP(A58,Funcionários!$A$2:$F$299,2,0)),\"Funcionário não encontrado\")","v":""},null,null,null,null,null,"",{"$f":"IFERROR(IF(A58=\"\",\"\",VLOOKUP(A58,Funcionários!$A$2:$F$299,5,0)),\"\")","v":""},""]
[null,{"$f":"IFERROR(IF(A59=\"\",\"\",VLOOKUP(A59,Funcionários!$A$2:$F$299,2,0)),\"Funcionário não encontrado\")","v":""},null,null,null,null,null,"",{"$f":"IFERROR(IF(A59=\"\",\"\",VLOOKUP(A59,Funcionários!$A$2:$F$299,5,0)),\"\")","v":""},""]
[null,{"$f":"IFERROR(IF(A60=\"\",\"\",VLOOKUP(A60,Funcionários!$A$2:$F$299,2,0)),\"Funcionário não encontrado\")","v":""},null,null,null,null,null,"",{"$f":"IFERROR(IF(A60=\"\",\"\",VLOOKUP(A60,Funcionários!$A$2:$F$299,5,0)),\"\")","v":""},""]
{"$rows_left_out":1942}
{"sheet":"Folha de Ponto","index":5,"n_rows":15,"n_cols":9,"rows_kept":15,"cut":false,"hidden":false,"merged":[[1,4,1,5],[3,2,3,3],[1,1,1,3],[2,2,2,3],[6,1,8,6],[6,7,6,8],[10,2,10,3],[10,5,10,6],[12,5,12,6],[12,2,12,3]]}
[]
[null,"Funcionário:",null,null,"Período:"]
[null,"Matrícula",null,null,"Data Inicial"]
[null,"Nome",{"$f":"IFERROR(IF(C3=\"\",\"\",VLOOKUP(C3,Funcionários!$A$2:$F$299,2,0)),\"Funcionário não encontrado\")","v":""},null,"Data Final"]
[]
[]
[null,"FOLHA DE PONTO INDIVIDUAL",null,null,null,null,null,"Período:"]
[null,null,null,null,null,null,null,"Data Inicial",{"$f":"IF(F3=\"\",\"\",F3)","v":""}]
[null,null,null,null,null,null,null,"Data Final",{"$f":"IF(F4=\"\",\"\",F4)","v":""}]
[]
[null,"Matrícula",{"$f":"IF(C3=\"\",\"\",C3)","v":""},null,"Função",{"$f":"IFERROR(IF(C3=\"\",\"\",VLOOKUP(C3,Funcionários!$A$2:$F$299,4,0)),\"Funcionário não encontrado\")","v":""},null,"Carga Horária Diária",{"$f":"IFERROR(IF(C3=\"\",\"\",VLOOKUP(C3,Funcionários!$A$2:$F$299,5,0)),\"Funcionário não encontrado\")","v":""}]
[null,"12/14/2024",null,null,0.95833333333333337,null,null,0.375]
[null,"Nome",{"$f":"IFERROR(IF(C3=\"\",\"\",VLOOKUP(C3,Funcionários!$A$2:$F$299,2,0)),\"Funcionário não encontrado\")","v":""},null,"Departamento",{"$f":"IFERROR(IF(C3=\"\",\"\",VLOOKUP(C3,Funcionários!$A$2:$F$299,3,0)),\"Funcionário não encontrado\")","v":""},null,"Data de Admissão",{"$f":"IFERROR(IF(C3=\"\",\"\",VLOOKUP(C3,Funcionários!$A$2:$F$299,6,0)),\"Funcionário não encontrado\")","v":""}]
[]
[null,"Data","Horário de Entrada","Horário de Saída p/ Intervalo","Horário de retorno do Intervalo","Horário de Saída","Horas Trabalhadas","Carga Horária / Diaria","Saldo do Dia"]